{"text_format":"1","workbook":"xlsx","n_sheets":10,"sheets":["Translations","Settings","Indicators","Data","Dashboard","Overview","Status","Aux","Aux 2","List"],"not_rendered":{"charts":24,"images":7,"macros":1,"external_links":0,"defined_names":112,"comments":5,"pivot_tables":0},"unopened":[],"bounds":{"document_bytes":16777216,"sheet_cells":100000,"rows_first":2000,"rows_last":500,"rows_between":2000,"halvings":0,"cell_chars":16384,"cell_head_chars":4096},"cells_cut":0,"cells_raw":0,"read":"whole","date_system":"1900"}

{"sheet":"Translations","index":0,"n_rows":69,"n_cols":7,"rows_kept":69,"cut":false,"hidden":true,"merged":[]}
[]
[]
[]
[null,null,"English","Français","Português","Español",{"$f":"Settings!D5","v":"Español"}]
[null,null,"1. SETTINGS","1. Paramètres","1. Configurações","1. AJUSTES",{"$f":"IFERROR(IF($G$4=$C$4,C5,IF($G$4=$D$4,D5,IF($G$4=$E$4,E5,IF(F5=\"\",C5,IF($G$4=$F$4,F5))))),\"\")","v":"1. AJUSTES"}]
[null,null,"-","-","-","-",{"$f":"IFERROR(IF($G$4=$C$4,C6,IF($G$4=$D$4,D6,IF($G$4=$E$4,E6,IF(F6=\"\",C6,IF($G$4=$F$4,F6))))),\"\")","v":"-"}]
[null,null,"Select Language:","Sélectionnez la langue :","Selecione Idioma:","Seleccione el idioma:","Seleccione el idioma:"]
[null,null,"Start Month:","Mois de début :","Mês de Início:","Mes de inicio:","Mes de inicio:"]
[null,null,"Current Year:","Année actuelle :","Ano Atual:","Año corriente:","Año corriente:"]
[null,null,"Choose your target rules for selecting color icons","Choisissez vos règles cibles pour sélectionner les icônes","Escolha as regras das metas  para selecão de ícones","Elija sus reglas de destino para seleccionar iconos de color","Elija sus reglas de destino para seleccionar iconos de color"]
[null,null,"If value is","Si la valeur est","Se valor for","Si el valor es","Si el valor es"]
[null,null,"If >","Si >","Se >","Si >","Si >"]
[null,null,"If <","Si <","Se <","Si <","Si <"]
[null,null,"And","et","e","y","y"]
[null,null,"2. CREATE INDICATORS","2. Entrer des données","2. Cadastro de indicadores","2. REGISTRO DE INDICADORES","2. REGISTRO DE INDICADORES"]
[null,null,"Format","Format","Formato","Formato","Formato"]
[null,null,"Best Direction","Meilleure direction","Melhor Direção","Mejor dirección","Mejor dirección"]
[null,null,"Financial","Financier","Financeiro","Financiero","Financiero"]
[null,null,"Customer","Client","Cliente","Cliente","Cliente"]
[null,null,"Process","Processus","Processos","Proceso","Proceso"]
[null,null,"Internal Business Process","Processus Interne","Processos Internos de Negócios","Proceso de negocio interno","Proceso de negocio interno"]
[null,null,"Learning & Growth","Apprentissage & croissance","Aprendizado & Crescimento","Aprendizaje y crecimiento","Aprendizaje y crecimiento"]
[null,null,"3. ENTER DATA","3. Métriques","3. Dados Dos indicadores","3. MÉTRICAS","3. MÉTRICAS"]
[null,null,"Actual / Target","Actuel / Cible","Real / Meta","Real / Objetivo","Real / Objetivo"]
[null,null,"Actual vs Target","Actuel vs Cible","Real vs Meta","Real vs Objetivo","Real vs Objetivo"]
[null,null,"Actual","Actuel","Real","Actual","Actual"]
[null,null,"% Target","% de la cible","% da Meta","% Objetivo","% Objetivo"]
[null,null,"Target","Cible","Meta","Meta","Meta"]
[null,null,"Remaining","Restant","Restante","Restante","Restante"]
[null,null,"Indicator Name","Indicateur","Indicador","Nombre del indicador","Nombre del indicador"]
[null,null,"YTD","Cumulées à ce jour","Acumulado","ACUM","ACUM"]
[null,null,"Total","Total","Total","Total","Total"]
[null,null,"Month","Mois","Mês","Mes","Mes"]
[null,null,"JAN","JAN","JAN","ENE","ENE"]
[null,null,"FEB","FÉV","FEV","FEB","FEB"]
[null,null,"MAR","MAR","MAR","MAR","MAR"]
[null,null,"APR","AVR","ABR","ABR","ABR"]
[null,null,"MAY","MAI","MAI","MAY","MAY"]
[null,null,"JUN","JUN","JUN","JUN","JUN"]
[null,null,"JUL","JUL","JUL","JUL","JUL"]
[null,null,"AUG","AOÛ","AGO","AGO","AGO"]
[null,null,"SEP","SEP","SET","SEP","SEP"]
[null,null,"OCT","OCT","OUT","OCT","OCT"]
[null,null,"NOV","NOV","NOV","NOV","NOV"]
[null,null,"DEC","DÉC","DEZ","DIC","DIC"]
[null,null,"January","janvier","Janeiro","Enero","Enero"]
[null,null,"February","février","Fevereiro","Febrero","Febrero"]
[null,null,"March","mars","Março","Marzo","Marzo"]
[null,null,"April","avril","Abril","Abril","Abril"]
[null,null,"May","mai","Maio","Mayo","Mayo"]
[null,null,"June","juin","Junho","Junio","Junio"]
[null,null,"July","juillet","Julho","Julio","Julio"]
[null,null,"August","août","Agosto","Agosto","Agosto"]
[null,null,"September","septembre","Setembro","Septiembre","Septiembre"]
[null,null,"October","octobre","Outubro","Octubre","Octubre"]
[null,null,"November","novembre","Novembro","Noviembre","Noviembre"]
[null,null,"December","décembre","Dezembro","Diciembre","Diciembre"]
[null,null,"Period","Période","Período","Periodo","Periodo"]
[null,null,"Indicator","Indicateur","Indicador","Indicador","Indicador"]
[null,null,"Result","Résultat","Resultado","Resultado","Resultado"]
[null,null,"Status","Statut","Status","Status","Status"]
[null,null,"Trend","Tendance","Tendência","Tendencia","Tendencia"]
[null,null,"6. STATUS VIEW","6. Vue d'état","6. Status","6. STATUS ",{"$f":"IFERROR(IF($G$4=$C$4,C63,IF($G$4=$D$4,D63,IF($G$4=$E$4,E63,IF(F63=\"\",C63,IF($G$4=$F$4,F63))))),\"\")","v":"6. STATUS "}]
[null,null,"4. DASHBOARD","4. Tableau de bord","4. Dashboard","4. DASHBOARD","4. DASHBOARD"]
[null,null,"5. OVERVIEW","5. Vue d'ensemble","5. Visão geral","5. RESUMEN",{"$f":"IFERROR(IF($G$4=$C$4,C65,IF($G$4=$D$4,D65,IF($G$4=$E$4,E65,IF(F65=\"\",C65,IF($G$4=$F$4,F65))))),\"\")","v":"5. RESUMEN"}]
[null,null,"Calculation","Calcul","Cálculo","Cálculo",{"$f":"IFERROR(IF($G$4=$C$4,C66,IF($G$4=$D$4,D66,IF($G$4=$E$4,E66,IF(F66=\"\",C66,IF($G$4=$F$4,F66))))),\"\")","v":"Cálculo"}]
[null,null,"Sum","Somme","Soma","Suma",{"$f":"IFERROR(IF($G$4=$C$4,C67,IF($G$4=$D$4,D67,IF($G$4=$E$4,E67,IF(F67=\"\",C67,IF($G$4=$F$4,F67))))),\"\")","v":"Suma"}]
[null,null,"Average","Moyen","Média","Promedio","Promedio"]
[null,null,"Last Value","Dernière valeur","Último valor","Último valor",{"$f":"IFERROR(IF($G$4=$C$4,C69,IF($G$4=$D$4,D69,IF($G$4=$E$4,E69,IF(F69=\"\",C69,IF($G$4=$F$4,F69))))),\"\")","v":"Último valor"}]

{"sheet":"Settings","index":1,"n_rows":13,"n_cols":6,"rows_kept":13,"cut":false,"hidden":false,"merged":[]}
[]
[]
[]
[]
[null,null,{"$f":"Translations!G7","v":"Seleccione el idioma:"},"Español"]
[]
[null,null,{"$f":"Translations!G8","v":"Mes de inicio:"},"ENE"]
[null,null,{"$f":"Translations!G9","v":"Año corriente:"},2026]
[]
[null,null,{"$f":"Translations!G10","v":"Elija sus reglas de destino para seleccionar iconos de color"}]
[null,null,"•",{"$f":"Translations!G11","v":"Si el valor es"},"> =",1]
[null,null,"•",{"$f":"F11","v":1},"> =",0.8]
[null,null,"•",{"$f":"F12","v":0.8}]

{"sheet":"Indicators","index":2,"n_rows":20,"n_cols":12,"rows_kept":20,"cut":false,"hidden":false,"merged":[[19,2,19,8],[10,3,10,5],[11,3,11,5],[4,3,4,5],[3,2,3,6],[5,3,5,5],[6,3,6,5],[7,3,7,5],[8,3,8,5],[9,3,9,5],[12,3,12,5],[13,3,13,5],[14,3,14,5],[15,3,15,5],[16,3,16,5]]}
[]
[]
[]
[]
[null,null,"ID",{"$f":"Translations!G30","v":"Nombre del indicador"},null,null,{"$f":"Translations!G16","v":"Formato"},{"$f":"Translations!G17","v":"Mejor dirección"},{"$f":"Translations!G66","v":"Cálculo"}]
[null,null,1,"Tasa de ingreso por ventas",null,null,"0%","↑","Promedio",{"$f":"VLOOKUP(G6,$K$6:$L$14,2,FALSE)","v":"0%"},"0%","0%"]
[null,null,2,"Tasa de cumplimiento de presupuesto",null,null,"0%","↑","Promedio",{"$f":"VLOOKUP(G7,$K$6:$L$14,2,FALSE)","v":"0%"},"0,0%","0.0%"]
[null,null,3,"Tasa de endeudamiento",null,null,"0%","↓","Promedio","0%","0","# ##0"]
[null,null,4,"Número de procesos de capacitación",null,null,"0","↑","Suma","# ##0","0 $","[$$-x-USD] # ##0"]
[null,null,5,"Eficiencia del ciclo de producción",null,null,"0%","↑","Promedio","0%","0 €","# ##0\\ [$€-x-euro1]"]
[null,null,6,"Tiempo de inactividad no planificada por TI",null,null,"0","↓","Promedio","# ##0","£ 0","[$£-en-GB]# ##0"]
[null,null,7,"Tasa de mantenimientos preventivos a los equipos",null,null,"0%","↑","Promedio","0%","R$ 0","[$R$-pt-BR]# ##0"]
[null,null,8,"Número de seguidores de FB",null,null,"0","↑","Último valor","# ##0","00:00:00","[h]:mm:ss"]
[null,null,9,"Tasa de conversión de leads a clientes",null,null,"0%","↑","Suma","0%","0,0","#,##0.0"]
[null,null,10,"Tiempo de resolución de quejas",null,null,"0","↓","Suma","# ##0"]
[null,null,11,"Tasa de litigios evitados",null,null,"0%","↓","Suma","0%"]
[null,null,12,"Retorno de inversión de nuevos proyectos",null,null,"0%","↑","Suma","0%"]
[]
[]
[null,null,"Nota:\nCuando termine de registrar sus indicadores, formato, mejor dirección y cálculo, es necesario hacer clic en el botón  \"Aplicar formatos\" para guardar los cambios. "]

{"sheet":"Data","index":3,"n_rows":40,"n_cols":22,"rows_kept":40,"cut":false,"hidden":false,"merged":[[22,2,24,2],[22,3,24,5],[13,2,15,2],[13,3,15,5],[16,2,18,2],[16,3,18,5],[19,2,21,2],[19,3,21,5],[34,2,36,2],[34,3,36,5],[37,2,39,2],[37,3,39,5],[25,2,27,2],[25,3,27,5],[28,2,30,2],[28,3,30,5],[31,2,33,2],[31,3,33,5],[10,2,12,2],[10,3,12,5],[3,3,3,5],[4,3,6,5],[4,2,6,2],[7,2,9,2],[7,3,9,5]]}
[]
[]
[]
[null,null,"ID",{"$f":"Translations!G30","v":"Nombre del indicador"},null,null,{"$f":"Translations!G24","v":"Real / Objetivo"},{"$f":"Settings!D7","v":"ENE"},{"$f":"IF(H4=List!$A$2,List!$A$3,IF(Data!H4=List!$A$3,List!$A$4,IF(H4=List!$A$4,List!$A$5,IF(H4=List!$A$5,List!$A$6,IF(H4=List!$A$6,List!$A$7,IF(H4=List!$A$7,List!$A$8,IF(H4=List!$A$8,List!$A$9,IF(Data!H4=List!$A$9,List!$A$10,IF(H4=List!$A$10,List!$A$11,IF(Data!H4=List!$A$11,List!$A$12,IF(H4=List!$A$12,List!$A$13,IF(H4=List!$A$13,List!$A$2))))))))))))","v":"FEB"},{"$f":"IF(I4=List!$A$2,List!$A$3,IF(Data!I4=List!$A$3,List!$A$4,IF(I4=List!$A$4,List!$A$5,IF(I4=List!$A$5,List!$A$6,IF(I4=List!$A$6,List!$A$7,IF(I4=List!$A$7,List!$A$8,IF(I4=List!$A$8,List!$A$9,IF(Data!I4=List!$A$9,List!$A$10,IF(I4=List!$A$10,List!$A$11,IF(Data!I4=List!$A$11,List!$A$12,IF(I4=List!$A$12,List!$A$13,IF(I4=List!$A$13,List!$A$2))))))))))))","v":"MAR"},{"$f":"IF(J4=List!$A$2,List!$A$3,IF(Data!J4=List!$A$3,List!$A$4,IF(J4=List!$A$4,List!$A$5,IF(J4=List!$A$5,List!$A$6,IF(J4=List!$A$6,List!$A$7,IF(J4=List!$A$7,List!$A$8,IF(J4=List!$A$8,List!$A$9,IF(Data!J4=List!$A$9,List!$A$10,IF(J4=List!$A$10,List!$A$11,IF(Data!J4=List!$A$11,List!$A$12,IF(J4=List!$A$12,List!$A$13,IF(J4=List!$A$13,List!$A$2))))))))))))","v":"ABR"},{"$f":"IF(K4=List!$A$2,List!$A$3,IF(Data!K4=List!$A$3,List!$A$4,IF(K4=List!$A$4,List!$A$5,IF(K4=List!$A$5,List!$A$6,IF(K4=List!$A$6,List!$A$7,IF(K4=List!$A$7,List!$A$8,IF(K4=List!$A$8,List!$A$9,IF(Data!K4=List!$A$9,List!$A$10,IF(K4=List!$A$10,List!$A$11,IF(Data!K4=List!$A$11,List!$A$12,IF(K4=List!$A$12,List!$A$13,IF(K4=List!$A$13,List!$A$2))))))))))))","v":"MAY"},{"$f":"IF(L4=List!$A$2,List!$A$3,IF(Data!L4=List!$A$3,List!$A$4,IF(L4=List!$A$4,List!$A$5,IF(L4=List!$A$5,List!$A$6,IF(L4=List!$A$6,List!$A$7,IF(L4=List!$A$7,List!$A$8,IF(L4=List!$A$8,List!$A$9,IF(Data!L4=List!$A$9,List!$A$10,IF(L4=List!$A$10,List!$A$11,IF(Data!L4=List!$A$11,List!$A$12,IF(L4=List!$A$12,List!$A$13,IF(L4=List!$A$13,List!$A$2))))))))))))","v":"JUN"},{"$f":"IF(M4=List!$A$2,List!$A$3,IF(Data!M4=List!$A$3,List!$A$4,IF(M4=List!$A$4,List!$A$5,IF(M4=List!$A$5,List!$A$6,IF(M4=List!$A$6,List!$A$7,IF(M4=List!$A$7,List!$A$8,IF(M4=List!$A$8,List!$A$9,IF(Data!M4=List!$A$9,List!$A$10,IF(M4=List!$A$10,List!$A$11,IF(Data!M4=List!$A$11,List!$A$12,IF(M4=List!$A$12,List!$A$13,IF(M4=List!$A$13,List!$A$2))))))))))))","v":"JUL"},{"$f":"IF(N4=List!$A$2,List!$A$3,IF(Data!N4=List!$A$3,List!$A$4,IF(N4=List!$A$4,List!$A$5,IF(N4=List!$A$5,List!$A$6,IF(N4=List!$A$6,List!$A$7,IF(N4=List!$A$7,List!$A$8,IF(N4=List!$A$8,List!$A$9,IF(Data!N4=List!$A$9,List!$A$10,IF(N4=List!$A$10,List!$A$11,IF(Data!N4=List!$A$11,List!$A$12,IF(N4=List!$A$12,List!$A$13,IF(N4=List!$A$13,List!$A$2))))))))))))","v":"AGO"},{"$f":"IF(O4=List!$A$2,List!$A$3,IF(Data!O4=List!$A$3,List!$A$4,IF(O4=List!$A$4,List!$A$5,IF(O4=List!$A$5,List!$A$6,IF(O4=List!$A$6,List!$A$7,IF(O4=List!$A$7,List!$A$8,IF(O4=List!$A$8,List!$A$9,IF(Data!O4=List!$A$9,List!$A$10,IF(O4=List!$A$10,List!$A$11,IF(Data!O4=List!$A$11,List!$A$12,IF(O4=List!$A$12,List!$A$13,IF(O4=List!$A$13,List!$A$2))))))))))))","v":"SEP"},{"$f":"IF(P4=List!$A$2,List!$A$3,IF(Data!P4=List!$A$3,List!$A$4,IF(P4=List!$A$4,List!$A$5,IF(P4=List!$A$5,List!$A$6,IF(P4=List!$A$6,List!$A$7,IF(P4=List!$A$7,List!$A$8,IF(P4=List!$A$8,List!$A$9,IF(Data!P4=List!$A$9,List!$A$10,IF(P4=List!$A$10,List!$A$11,IF(Data!P4=List!$A$11,List!$A$12,IF(P4=List!$A$12,List!$A$13,IF(P4=List!$A$13,List!$A$2))))))))))))","v":"OCT"},{"$f":"IF(Q4=List!$A$2,List!$A$3,IF(Data!Q4=List!$A$3,List!$A$4,IF(Q4=List!$A$4,List!$A$5,IF(Q4=List!$A$5,List!$A$6,IF(Q4=List!$A$6,List!$A$7,IF(Q4=List!$A$7,List!$A$8,IF(Q4=List!$A$8,List!$A$9,IF(Data!Q4=List!$A$9,List!$A$10,IF(Q4=List!$A$10,List!$A$11,IF(Data!Q4=List!$A$11,List!$A$12,IF(Q4=List!$A$12,List!$A$13,IF(Q4=List!$A$13,List!$A$2))))))))))))","v":"NOV"},{"$f":"IF(R4=List!$A$2,List!$A$3,IF(Data!R4=List!$A$3,List!$A$4,IF(R4=List!$A$4,List!$A$5,IF(R4=List!$A$5,List!$A$6,IF(R4=List!$A$6,List!$A$7,IF(R4=List!$A$7,List!$A$8,IF(R4=List!$A$8,List!$A$9,IF(Data!R4=List!$A$9,List!$A$10,IF(R4=List!$A$10,List!$A$11,IF(Data!R4=List!$A$11,List!$A$12,IF(R4=List!$A$12,List!$A$13,IF(R4=List!$A$13,List!$A$2))))))))))))","v":"DIC"},{"$f":"Translations!G31","v":"ACUM"},{"$f":"Translations!G32","v":"Total"}]
[null,null,1,{"$f":"IF(Indicators!D6=\"\",\"\",Indicators!D6)","v":"Tasa de ingreso por ventas"},null,null,{"$f":"Translations!G26","v":"Actual"},0.16,0.03,0.13,0.11,0.25,0.1,0.1,0.06,null,null,null,null,{"$f":"IFERROR(IF(Indicators!$I$6=List!$H$4,INDEX(H5:S5,COUNT(H5:S5)),IF(Indicators!$I$6=List!$H$2,SUM(Data!$H5:$S5),IF(Indicators!$I$6=List!$H$3,AVERAGEIF(H5:S5,\"<>\",H5:S5)))),0)","v":0.11749999999999999},{"$f":"IFERROR(IF(Indicators!$I$6=List!$H$4,INDEX(H5:S5,COUNT(H5:S5)),IF(Indicators!$I$6=List!$H$2,SUM(Data!$H5:$S5),IF(Indicators!$I$6=List!$H$3,AVERAGEIF(H5:S5,\"<>\",H5:S5)))),0)","v":0.11749999999999999}]
[null,null,null,null,null,null,{"$f":"Translations!G28","v":"Meta"},0.2,0.2,0.2,0.2,0.2,0.2,0.2,0.2,0.2,0.2,0.2,0.2,{"$f":"IFERROR(IF(Indicators!$I$6=List!$H$4,V6,IF(Indicators!$I$6=List!$H$2,SUMIF(H5:S5,\"<>\",H6:S6),IF(Indicators!$I$6=List!$H$3,AVERAGEIF($H$5:$S$5,\"<>\",H6:S6)))),0)","v":0.19999999999999998},{"$f":"IFERROR(IF(Indicators!$I$6=List!$H$4,INDEX(H6:S6,COUNT(H6:S6)),IF(Indicators!$I$6=List!$H$2,SUM(Data!$H6:$S6),IF(Indicators!$I$6=List!$H$3,AVERAGE(H6:S6)))),0)","v":0.19999999999999998},{"$f":"IF(S5<>\"\",S6,IF(R5<>\"\",R6,IF(Q5<>\"\",Q6,IF(P5<>\"\",P6,IF(O5<>\"\",O6,IF(N5<>\"\",N6,IF(M5<>\"\",M6,IF(L5<>\"\",L6,IF(K5<>\"\",K6,IF(J5<>\"\",J6,IF(I5<>\"\",I6,IF(H5<>\"\",H6,0))))))))))))","v":0.2}]
[null,null,null,null,null,null,"% Target",{"$f":"IFERROR(H5/H6,0)","v":0.79999999999999993},{"$f":"IFERROR(I5/I6,0)","v":0.15},{"$f":"IFERROR(J5/J6,0)","v":0.65},0.54999999999999993,1.25,0.5,0.5,0.3,{"$f":"IFERROR(P5/P6,0)","v":0},0,0,0,{"$f":"IFERROR(T5/T6,0)","v":0.58750000000000002},{"$f":"IFERROR(U5/U6,0)","v":0.58750000000000002}]
[null,null,{"$f":"C5+1","v":2},{"$f":"IF(Indicators!D7=\"\",\"\",Indicators!D7)","v":"Tasa de cumplimiento de presupuesto"},null,null,{"$f":"G5","v":"Actual"},null,null,null,null,null,null,null,null,null,null,null,null,{"$f":"IFERROR(IF(Indicators!$I$7=List!$H$4,INDEX(H8:S8,COUNT(H8:S8)),IF(Indicators!$I$7=List!$H$2,SUM(Data!$H8:$S8),IF(Indicators!$I$7=List!$H$3,AVERAGEIF(H8:S8,\"<>\",H8:S8)))),0)","v":0},{"$f":"IFERROR(IF(Indicators!$I$7=List!$H$4,INDEX(H8:S8,COUNT(H8:S8)),IF(Indicators!$I$7=List!$H$2,SUM(Data!$H8:$S8),IF(Indicators!$I$7=List!$H$3,AVERAGEIF(H8:S8,\"<>\",H8:S8)))),0)","v":0}]
[null,null,null,null,null,null,{"$f":"G6","v":"Meta"},null,null,null,null,null,null,null,null,null,null,null,null,{"$f":"IFERROR(IF(Indicators!$I$7=List!$H$4,V9,IF(Indicators!$I$7=List!$H$2,SUMIF(H8:S8,\"<>\",H9:S9),IF(Indicators!$I$7=List!$H$3,AVERAGEIF($H$8:$S$8,\"<>\",H9:S9)))),0)","v":0},{"$f":"IFERROR(IF(Indicators!$I$7=List!$H$4,INDEX(H9:S9,COUNT(H9:S9)),IF(Indicators!$I$7=List!$H$2,SUM(Data!$H9:$S9),IF(Indicators!$I$7=List!$H$3,AVERAGE(H9:S9)))),0)","v":0},{"$f":"IF(S8<>\"\",S9,IF(R8<>\"\",R9,IF(Q8<>\"\",Q9,IF(P8<>\"\",P9,IF(O8<>\"\",O9,IF(N8<>\"\",N9,IF(M8<>\"\",M9,IF(L8<>\"\",L9,IF(K8<>\"\",K9,IF(J8<>\"\",J9,IF(I8<>\"\",I9,IF(H8<>\"\",H9,0))))))))))))","v":0}]
[null,null,null,null,null,null,"% Target",{"$f":"IFERROR(H8/H9,0)","v":0},{"$f":"IFERROR(I8/I9,0)","v":0},0,0,0,0,0,0,{"$f":"IFERROR(P8/P9,0)","v":0},0,0,0,{"$f":"IFERROR(T8/T9,0)","v":0},{"$f":"IFERROR(U8/U9,0)","v":0}]
[null,null,{"$f":"C8+1","v":3},{"$f":"IF(Indicators!D8=\"\",\"\",Indicators!D8)","v":"Tasa de endeudamiento"},null,null,{"$f":"G8","v":"Actual"},null,null,null,null,null,null,null,null,null,null,null,null,{"$f":"IFERROR(IF(Indicators!$I$8=List!$H$4,INDEX(H11:S11,COUNT(H11:S11)),IF(Indicators!$I$8=List!$H$2,SUM(Data!$H11:$S11),IF(Indicators!$I$8=List!$H$3,AVERAGEIF(H11:S11,\"<>\",H11:S11)))),0)","v":0},{"$f":"IFERROR(IF(Indicators!$I$8=List!$H$4,INDEX(H11:S11,COUNT(H11:S11)),IF(Indicators!$I$8=List!$H$2,SUM(Data!$H11:$S11),IF(Indicators!$I$8=List!$H$3,AVERAGEIF(H11:S11,\"<>\",H11:S11)))),0)","v":0}]
[null,null,null,null,null,null,{"$f":"G9","v":"Meta"},null,null,null,null,null,null,null,null,null,null,null,null,{"$f":"IFERROR(IF(Indicators!$I$8=List!$H$4,V12,IF(Indicators!$I$8=List!$H$2,SUMIF(H11:S11,\"<>\",H12:S12),IF(Indicators!$I$8=List!$H$3,AVERAGEIF($H$11:$S$11,\"<>\",H12:S12)))),0)","v":0},{"$f":"IFERROR(IF(Indicators!$I$8=List!$H$4,INDEX(H12:S12,COUNT(H12:S12)),IF(Indicators!$I$8=List!$H$2,SUM(Data!$H12:$S12),IF(Indicators!$I$8=List!$H$3,AVERAGE(H12:S12)))),0)","v":0},{"$f":"IF(S11<>\"\",S12,IF(R11<>\"\",R12,IF(Q11<>\"\",Q12,IF(P11<>\"\",P12,IF(O11<>\"\",O12,IF(N11<>\"\",N12,IF(M11<>\"\",M12,IF(L11<>\"\",L12,IF(K11<>\"\",K12,IF(J11<>\"\",J12,IF(I11<>\"\",I12,IF(H11<>\"\",H12,0))))))))))))","v":0}]
[null,null,null,null,null,null,"% Target",{"$f":"IFERROR(H11/H12,0)","v":0},{"$f":"IFERROR(I11/I12,0)","v":0},0,0,0,0,0,0,{"$f":"IFERROR(P11/P12,0)","v":0},0,0,0,{"$f":"IFERROR(T11/T12,0)","v":0},{"$f":"IFERROR(U11/U12,0)","v":0}]
[null,null,{"$f":"C11+1","v":4},{"$f":"IF(Indicators!D9=\"\",\"\",Indicators!D9)","v":"Número de procesos de capacitación"},null,null,{"$f":"G11","v":"Actual"},1,2,1,null,null,null,null,null,null,null,null,null,{"$f":"IFERROR(IF(Indicators!$I$9=List!$H$4,INDEX(H14:S14,COUNT(H14:S14)),IF(Indicators!$I$9=List!$H$2,SUM(Data!$H14:$S14),IF(Indicators!$I$9=List!$H$3,AVERAGEIF(H14:S14,\"<>\",H14:S14)))),0)","v":4},{"$f":"IFERROR(IF(Indicators!$I$9=List!$H$4,INDEX(H14:S14,COUNT(H14:S14)),IF(Indicators!$I$9=List!$H$2,SUM(Data!$H14:$S14),IF(Indicators!$I$9=List!$H$3,AVERAGEIF(H14:S14,\"<>\",H14:S14)))),0)","v":4}]
[null,null,null,null,null,null,{"$f":"G12","v":"Meta"},1,2,2,null,null,null,null,null,null,null,null,null,{"$f":"IFERROR(IF(Indicators!$I$9=List!$H$4,V15,IF(Indicators!$I$9=List!$H$2,SUMIF(H14:S14,\"<>\",H15:S15),IF(Indicators!$I$9=List!$H$3,AVERAGEIF($H$14:$S$14,\"<>\",H15:S15)))),0)","v":5},{"$f":"IFERROR(IF(Indicators!$I$9=List!$H$4,INDEX(H15:S15,COUNT(H15:S15)),IF(Indicators!$I$9=List!$H$2,SUM(Data!$H15:$S15),IF(Indicators!$I$9=List!$H$3,AVERAGE(H15:S15)))),0)","v":5},{"$f":"IF(S14<>\"\",S15,IF(R14<>\"\",R15,IF(Q14<>\"\",Q15,IF(P14<>\"\",P15,IF(O14<>\"\",O15,IF(N14<>\"\",N15,IF(M14<>\"\",M15,IF(L14<>\"\",L15,IF(K14<>\"\",K15,IF(J14<>\"\",J15,IF(I14<>\"\",I15,IF(H14<>\"\",H15,0))))))))))))","v":2}]
[null,null,null,null,null,null,"% Target",{"$f":"IFERROR(H14/H15,0)","v":1},{"$f":"IFERROR(I14/I15,0)","v":1},0.5,0,0,0,0,0,{"$f":"IFERROR(P14/P15,0)","v":0},0,0,0,{"$f":"IFERROR(T14/T15,0)","v":0.8},{"$f":"IFERROR(U14/U15,0)","v":0.8}]
[null,null,{"$f":"C14+1","v":5},{"$f":"IF(Indicators!D10=\"\",\"\",Indicators!D10)","v":"Eficiencia del ciclo de producción"},null,null,{"$f":"G14","v":"Actual"},null,null,null,null,null,null,null,null,null,null,null,null,{"$f":"IFERROR(IF(Indicators!$I$10=List!$H$4,INDEX(H17:S17,COUNT(H17:S17)),IF(Indicators!$I$10=List!$H$2,SUM(Data!$H17:$S17),IF(Indicators!$I$10=List!$H$3,AVERAGEIF(H17:S17,\"<>\",H17:S17)))),0)","v":0},{"$f":"IFERROR(IF(Indicators!$I$10=List!$H$4,INDEX(H17:S17,COUNT(H17:S17)),IF(Indicators!$I$10=List!$H$2,SUM(Data!$H17:$S17),IF(Indicators!$I$10=List!$H$3,AVERAGEIF(H17:S17,\"<>\",H17:S17)))),0)","v":0}]
[null,null,null,null,null,null,{"$f":"G15","v":"Meta"},null,null,null,null,null,null,null,null,null,null,null,null,{"$f":"IFERROR(IF(Indicators!$I$10=List!$H$4,V18,IF(Indicators!$I$10=List!$H$2,SUMIF(H17:S17,\"<>\",H18:S18),IF(Indicators!$I$10=List!$H$3,AVERAGEIF($H$17:$S$17,\"<>\",H18:S18)))),0)","v":0},{"$f":"IFERROR(IF(Indicators!$I$10=List!$H$4,INDEX(H18:S18,COUNT(H18:S18)),IF(Indicators!$I$10=List!$H$2,SUM(Data!$H18:$S18),IF(Indicators!$I$10=List!$H$3,AVERAGE(H18:S18)))),0)","v":0},{"$f":"IF(S17<>\"\",S18,IF(R17<>\"\",R18,IF(Q17<>\"\",Q18,IF(P17<>\"\",P18,IF(O17<>\"\",O18,IF(N17<>\"\",N18,IF(M17<>\"\",M18,IF(L17<>\"\",L18,IF(K17<>\"\",K18,IF(J17<>\"\",J18,IF(I17<>\"\",I18,IF(H17<>\"\",H18,0))))))))))))","v":0}]
[null,null,null,null,null,null,"% Target",{"$f":"IFERROR(H17/H18,0)","v":0},{"$f":"IFERROR(I17/I18,0)","v":0},0,0,0,0,0,0,{"$f":"IFERROR(P17/P18,0)","v":0},0,0,0,{"$f":"IFERROR(T17/T18,0)","v":0},{"$f":"IFERROR(U17/U18,0)","v":0}]
[null,null,{"$f":"C17+1","v":6},{"$f":"IF(Indicators!D11=\"\",\"\",Indicators!D11)","v":"Tiempo de inactividad no planificada por TI"},null,null,{"$f":"G17","v":"Actual"},null,null,null,null,null,null,null,null,null,null,null,null,{"$f":"IFERROR(IF(Indicators!$I$11=List!$H$4,INDEX(H20:S20,COUNT(H20:S20)),IF(Indicators!$I$11=List!$H$2,SUM(Data!$H20:$S20),IF(Indicators!$I$11=List!$H$3,AVERAGEIF(H20:S20,\"<>\",H20:S20)))),0)","v":0},{"$f":"IFERROR(IF(Indicators!$I$11=List!$H$4,INDEX(H20:S20,COUNT(H20:S20)),IF(Indicators!$I$11=List!$H$2,SUM(Data!$H20:$S20),IF(Indicators!$I$11=List!$H$3,AVERAGEIF(H20:S20,\"<>\",H20:S20)))),0)","v":0}]
[null,null,null,null,null,null,{"$f":"G18","v":"Meta"},null,null,null,null,null,null,null,null,null,null,null,null,{"$f":"IFERROR(IF(Indicators!$I$11=List!$H$4,V21,IF(Indicators!$I$11=List!$H$2,SUMIF(H20:S20,\"<>\",H21:S21),IF(Indicators!$I$11=List!$H$3,AVERAGEIF($H$20:$S$20,\"<>\",H21:S21)))),0)","v":0},{"$f":"IFERROR(IF(Indicators!$I$11=List!$H$4,INDEX(H21:S21,COUNT(H21:S21)),IF(Indicators!$I$11=List!$H$2,SUM(Data!$H21:$S21),IF(Indicators!$I$11=List!$H$3,AVERAGE(H21:S21)))),0)","v":0},{"$f":"IF(S20<>\"\",S21,IF(R20<>\"\",R21,IF(Q20<>\"\",Q21,IF(P20<>\"\",P21,IF(O20<>\"\",O21,IF(N20<>\"\",N21,IF(M20<>\"\",M21,IF(L20<>\"\",L21,IF(K20<>\"\",K21,IF(J20<>\"\",J21,IF(I20<>\"\",I21,IF(H20<>\"\",H21,0))))))))))))","v":0}]
[null,null,null,null,null,null,"% Target",{"$f":"IFERROR(H20/H21,0)","v":0},{"$f":"IFERROR(I20/I21,0)","v":0},0,0,0,0,0,0,{"$f":"IFERROR(P20/P21,0)","v":0},0,0,0,{"$f":"IFERROR(T20/T21,0)","v":0},{"$f":"IFERROR(U20/U21,0)","v":0}]
[null,null,{"$f":"C20+1","v":7},{"$f":"IF(Indicators!D12=\"\",\"\",Indicators!D12)","v":"Tasa de mantenimientos preventivos a los equipos"},null,null,{"$f":"G20","v":"Actual"},null,null,null,null,null,null,null,null,null,null,null,null,{"$f":"IFERROR(IF(Indicators!$I$12=List!$H$4,INDEX(H23:S23,COUNT(H23:S23)),IF(Indicators!$I$12=List!$H$2,SUM(Data!$H23:$S23),IF(Indicators!$I$12=List!$H$3,AVERAGEIF(H23:S23,\"<>\",H23:S23)))),0)","v":0},{"$f":"IFERROR(IF(Indicators!$I$12=List!$H$4,INDEX(H23:S23,COUNT(H23:S23)),IF(Indicators!$I$12=List!$H$2,SUM(Data!$H23:$S23),IF(Indicators!$I$12=List!$H$3,AVERAGEIF(H23:S23,\"<>\",H23:S23)))),0)","v":0}]
[null,null,null,null,null,null,{"$f":"G21","v":"Meta"},null,null,null,null,null,null,null,null,null,null,null,null,{"$f":"IFERROR(IF(Indicators!$I$12=List!$H$4,V24,IF(Indicators!$I$12=List!$H$2,SUMIF(H23:S23,\"<>\",H24:S24),IF(Indicators!$I$12=List!$H$3,AVERAGEIF($H$23:$S$23,\"<>\",H24:S24)))),0)","v":0},{"$f":"IFERROR(IF(Indicators!$I$12=List!$H$4,INDEX(H24:S24,COUNT(H24:S24)),IF(Indicators!$I$12=List!$H$2,SUM(Data!$H24:$S24),IF(Indicators!$I$12=List!$H$3,AVERAGE(H24:S24)))),0)","v":0},{"$f":"IF(S23<>\"\",S24,IF(R23<>\"\",R24,IF(Q23<>\"\",Q24,IF(P23<>\"\",P24,IF(O23<>\"\",O24,IF(N23<>\"\",N24,IF(M23<>\"\",M24,IF(L23<>\"\",L24,IF(K23<>\"\",K24,IF(J23<>\"\",J24,IF(I23<>\"\",I24,IF(H23<>\"\",H24,0))))))))))))","v":0}]
[null,null,null,null,null,null,"% Target",{"$f":"IFERROR(H23/H24,0)","v":0},{"$f":"IFERROR(I23/I24,0)","v":0},0,0,0,0,0,0,{"$f":"IFERROR(P23/P24,0)","v":0},0,0,0,{"$f":"IFERROR(T23/T24,0)","v":0},{"$f":"IFERROR(U23/U24,0)","v":0}]
[null,null,{"$f":"C23+1","v":8},{"$f":"IF(Indicators!D13=\"\",\"\",Indicators!D13)","v":"Número de seguidores de FB"},null,null,{"$f":"G23","v":"Actual"},15000,15348,null,null,null,null,null,null,null,null,null,null,{"$f":"IFERROR(IF(Indicators!$I$13=List!$H$4,INDEX(H26:S26,COUNT(H26:S26)),IF(Indicators!$I$13=List!$H$2,SUM(Data!$H26:$S26),IF(Indicators!$I$13=List!$H$3,AVERAGEIF(H26:S26,\"<>\",H26:S26)))),0)","v":15348},{"$f":"IFERROR(IF(Indicators!$I$13=List!$H$4,INDEX(H26:S26,COUNT(H26:S26)),IF(Indicators!$I$13=List!$H$2,SUM(Data!$H26:$S26),IF(Indicators!$I$13=List!$H$3,AVERAGEIF(H26:S26,\"<>\",H26:S26)))),0)","v":15348}]
[null,null,null,null,null,null,{"$f":"G24","v":"Meta"},15500,16000,null,null,null,null,null,null,null,null,null,null,{"$f":"IFERROR(IF(Indicators!$I$13=List!$H$4,V27,IF(Indicators!$I$13=List!$H$2,SUMIF(H26:S26,\"<>\",H27:S27),IF(Indicators!$I$13=List!$H$3,AVERAGEIF($H$26:$S$26,\"<>\",H27:S27)))),0)","v":16000},{"$f":"IFERROR(IF(Indicators!$I$13=List!$H$4,INDEX(H27:S27,COUNT(H27:S27)),IF(Indicators!$I$13=List!$H$2,SUM(Data!$H27:$S27),IF(Indicators!$I$13=List!$H$3,AVERAGE(H27:S27)))),0)","v":16000},{"$f":"IF(S26<>\"\",S27,IF(R26<>\"\",R27,IF(Q26<>\"\",Q27,IF(P26<>\"\",P27,IF(O26<>\"\",O27,IF(N26<>\"\",N27,IF(M26<>\"\",M27,IF(L26<>\"\",L27,IF(K26<>\"\",K27,IF(J26<>\"\",J27,IF(I26<>\"\",I27,IF(H26<>\"\",H27,0))))))))))))","v":16000}]
[null,null,null,null,null,null,"% Target",{"$f":"IFERROR(H26/H27,0)","v":0.967741935483871},{"$f":"IFERROR(I26/I27,0)","v":0.95925000000000005},0,0,0,0,0,0,{"$f":"IFERROR(P26/P27,0)","v":0},0,0,0,0.95925000000000005,0.95925000000000005]
[null,null,{"$f":"C26+1","v":9},{"$f":"IF(Indicators!D14=\"\",\"\",Indicators!D14)","v":"Tasa de conversión de leads a clientes"},null,null,{"$f":"G26","v":"Actual"},null,null,null,null,null,null,null,null,null,null,null,null,{"$f":"IFERROR(IF(Indicators!$I$14=List!$H$4,INDEX(H29:S29,COUNT(H29:S29)),IF(Indicators!$I$14=List!$H$2,SUM(Data!$H29:$S29),IF(Indicators!$I$14=List!$H$3,AVERAGEIF(H29:S29,\"<>\",H29:S29)))),0)","v":0},{"$f":"IFERROR(IF(Indicators!$I$14=List!$H$4,INDEX(H29:S29,COUNT(H29:S29)),IF(Indicators!$I$14=List!$H$2,SUM(Data!$H29:$S29),IF(Indicators!$I$14=List!$H$3,AVERAGEIF(H29:S29,\"<>\",H29:S29)))),0)","v":0}]
[null,null,null,null,null,null,{"$f":"G27","v":"Meta"},null,null,null,null,null,null,null,null,null,null,null,null,{"$f":"IFERROR(IF(Indicators!$I$14=List!$H$4,V30,IF(Indicators!$I$14=List!$H$2,SUMIF(H29:S29,\"<>\",H30:S30),IF(Indicators!$I$14=List!$H$3,AVERAGEIF($H$29:$S$29,\"<>\",H30:S30)))),0)","v":0},{"$f":"IFERROR(IF(Indicators!$I$14=List!$H$4,INDEX(H30:S30,COUNT(H30:S30)),IF(Indicators!$I$14=List!$H$2,SUM(Data!$H30:$S30),IF(Indicators!$I$14=List!$H$3,AVERAGE(H30:S30)))),0)","v":0},{"$f":"IF(S29<>\"\",S30,IF(R29<>\"\",R30,IF(Q29<>\"\",Q30,IF(P29<>\"\",P30,IF(O29<>\"\",O30,IF(N29<>\"\",N30,IF(M29<>\"\",M30,IF(L29<>\"\",L30,IF(K29<>\"\",K30,IF(J29<>\"\",J30,IF(I29<>\"\",I30,IF(H29<>\"\",H30,0))))))))))))","v":0}]
[null,null,null,null,null,null,"% Target",{"$f":"IFERROR(H29/H30,0)","v":0},{"$f":"IFERROR(I29/I30,0)","v":0},0,0,0,0,0,0,{"$f":"IFERROR(P29/P30,0)","v":0},0,0,0,0,0]
[null,null,{"$f":"C29+1","v":10},{"$f":"IF(Indicators!D15=\"\",\"\",Indicators!D15)","v":"Tiempo de resolución de quejas"},null,null,{"$f":"G29","v":"Actual"},null,null,null,null,null,null,null,null,null,null,null,null,{"$f":"IFERROR(IF(Indicators!$I$15=List!$H$4,INDEX(H32:S32,COUNT(H32:S32)),IF(Indicators!$I$15=List!$H$2,SUM(Data!$H32:$S32),IF(Indicators!$I$15=List!$H$3,AVERAGEIF(H32:S32,\"<>\",H32:S32)))),0)","v":0},{"$f":"IFERROR(IF(Indicators!$I$15=List!$H$4,INDEX(H32:S32,COUNT(H32:S32)),IF(Indicators!$I$15=List!$H$2,SUM(Data!$H32:$S32),IF(Indicators!$I$15=List!$H$3,AVERAGEIF(H32:S32,\"<>\",H32:S32)))),0)","v":0}]
[null,null,null,null,null,null,{"$f":"G30","v":"Meta"},null,null,null,null,null,null,null,null,null,null,null,null,{"$f":"IFERROR(IF(Indicators!$I$15=List!$H$4,V33,IF(Indicators!$I$15=List!$H$2,SUMIF(H32:S32,\"<>\",H33:S33),IF(Indicators!$I$15=List!$H$3,AVERAGEIF($H$32:$S$32,\"<>\",H33:S33)))),0)","v":0},{"$f":"IFERROR(IF(Indicators!$I$15=List!$H$4,INDEX(H33:S33,COUNT(H33:S33)),IF(Indicators!$I$15=List!$H$2,SUM(Data!$H33:$S33),IF(Indicators!$I$15=List!$H$3,AVERAGE(H33:S33)))),0)","v":0},{"$f":"IF(S32<>\"\",S33,IF(R32<>\"\",R33,IF(Q32<>\"\",Q33,IF(P32<>\"\",P33,IF(O32<>\"\",O33,IF(N32<>\"\",N33,IF(M32<>\"\",M33,IF(L32<>\"\",L33,IF(K32<>\"\",K33,IF(J32<>\"\",J33,IF(I32<>\"\",I33,IF(H32<>\"\",H33,0))))))))))))","v":0}]
[null,null,null,null,null,null,"% Target",{"$f":"IFERROR(H32/H33,0)","v":0},{"$f":"IFERROR(I32/I33,0)","v":0},0,0,0,0,0,0,{"$f":"IFERROR(P32/P33,0)","v":0},0,0,0,0,0]
[null,null,{"$f":"C32+1","v":11},{"$f":"IF(Indicators!D16=\"\",\"\",Indicators!D16)","v":"Tasa de litigios evitados"},null,null,{"$f":"G32","v":"Actual"},null,null,null,null,null,null,null,null,null,null,null,null,{"$f":"IFERROR(IF(Indicators!$I$16=List!$H$4,INDEX(H35:S35,COUNT(H35:S35)),IF(Indicators!$I$16=List!$H$2,SUM(Data!$H35:$S35),IF(Indicators!$I$16=List!$H$3,AVERAGEIF(H35:S35,\"<>\",H35:S35)))),0)","v":0},{"$f":"IFERROR(IF(Indicators!$I$16=List!$H$4,INDEX(H35:S35,COUNT(H35:S35)),IF(Indicators!$I$16=List!$H$2,SUM(Data!$H35:$S35),IF(Indicators!$I$16=List!$H$3,AVERAGEIF(H35:S35,\"<>\",H35:S35)))),0)","v":0}]
[null,null,null,null,null,null,{"$f":"G33","v":"Meta"},null,null,null,null,null,null,null,null,null,null,null,null,{"$f":"IFERROR(IF(Indicators!$I$16=List!$H$4,V36,IF(Indicators!$I$16=List!$H$2,SUMIF(H35:S35,\"<>\",H36:S36),IF(Indicators!$I$16=List!$H$3,AVERAGEIF($H$35:$S$35,\"<>\",H36:S36)))),0)","v":0},{"$f":"IFERROR(IF(Indicators!$I$16=List!$H$4,INDEX(H36:S36,COUNT(H36:S36)),IF(Indicators!$I$16=List!$H$2,SUM(Data!$H36:$S36),IF(Indicators!$I$16=List!$H$3,AVERAGE(H36:S36)))),0)","v":0},{"$f":"IF(S35<>\"\",S36,IF(R35<>\"\",R36,IF(Q35<>\"\",Q36,IF(P35<>\"\",P36,IF(O35<>\"\",O36,IF(N35<>\"\",N36,IF(M35<>\"\",M36,IF(L35<>\"\",L36,IF(K35<>\"\",K36,IF(J35<>\"\",J36,IF(I35<>\"\",I36,IF(H35<>\"\",H36,0))))))))))))","v":0}]
[null,null,null,null,null,null,"% Target",{"$f":"IFERROR(H35/H36,0)","v":0},{"$f":"IFERROR(I35/I36,0)","v":0},0,0,0,0,0,0,{"$f":"IFERROR(P35/P36,0)","v":0},0,0,0,0,0]
[null,null,{"$f":"C35+1","v":12},{"$f":"IF(Indicators!D17=\"\",\"\",Indicators!D17)","v":"Retorno de inversión de nuevos proyectos"},null,null,{"$f":"G35","v":"Actual"},null,null,null,null,null,null,null,null,null,null,null,null,{"$f":"IFERROR(IF(Indicators!$I$17=List!$H$4,INDEX(H38:S38,COUNT(H38:S38)),IF(Indicators!$I$17=List!$H$2,SUM(Data!$H38:$S38),IF(Indicators!$I$17=List!$H$3,AVERAGEIF(H38:S38,\"<>\",H38:S38)))),0)","v":0},{"$f":"IFERROR(IF(Indicators!$I$17=List!$H$4,INDEX(H38:S38,COUNT(H38:S38)),IF(Indicators!$I$17=List!$H$2,SUM(Data!$H38:$S38),IF(Indicators!$I$17=List!$H$3,AVERAGEIF(H38:S38,\"<>\",H38:S38)))),0)","v":0}]
[null,null,null,null,null,null,{"$f":"G36","v":"Meta"},null,null,null,null,null,null,null,null,null,null,null,null,{"$f":"IFERROR(IF(Indicators!$I$17=List!$H$4,V39,IF(Indicators!$I$17=List!$H$2,SUMIF(H38:S38,\"<>\",H39:S39),IF(Indicators!$I$17=List!$H$3,AVERAGEIF($H$38:$S$38,\"<>\",H39:S39)))),0)","v":0},{"$f":"IFERROR(IF(Indicators!$I$17=List!$H$4,INDEX(H39:S39,COUNT(H39:S39)),IF(Indicators!$I$17=List!$H$2,SUM(Data!$H39:$S39),IF(Indicators!$I$17=List!$H$3,AVERAGE(H39:S39)))),0)","v":0},{"$f":"IF(S38<>\"\",S39,IF(R38<>\"\",R39,IF(Q38<>\"\",Q39,IF(P38<>\"\",P39,IF(O38<>\"\",O39,IF(N38<>\"\",N39,IF(M38<>\"\",M39,IF(L38<>\"\",L39,IF(K38<>\"\",K39,IF(J38<>\"\",J39,IF(I38<>\"\",I39,IF(H38<>\"\",H39,0))))))))))))","v":0}]
[null,null,null,null,null,null,"% Target",{"$f":"IFERROR(H38/H39,0)","v":0},{"$f":"IFERROR(I38/I39,0)","v":0},0,0,0,0,0,0,{"$f":"IFERROR(P38/P39,0)","v":0},0,0,0,0,0]

{"sheet":"Dashboard","index":4,"n_rows":21,"n_cols":23,"rows_kept":21,"cut":false,"hidden":false,"merged":[[18,2,18,5],[19,2,19,5],[20,2,20,3],[20,4,20,5],[18,7,18,10],[19,7,19,10],[20,7,20,8],[20,9,20,10],[18,17,18,20],[19,17,19,20],[20,17,20,18],[20,19,20,20],[18,12,18,15],[19,12,19,15],[20,12,20,13],[20,14,20,15],[12,12,12,15],[13,12,13,13],[13,14,13,15],[11,17,11,20],[12,17,12,20],[13,17,13,18],[13,19,13,20],[4,17,4,20],[5,17,5,20],[6,17,6,18],[6,19,6,20],[11,2,11,5],[11,12,11,15],[12,2,12,5],[13,2,13,3],[13,4,13,5],[11,7,11,10],[12,7,12,10],[13,7,13,8],[13,9,13,10],[3,3,3,4],[6,14,6,15],[4,12,4,15],[5,12,5,15],[4,7,4,10],[5,7,5,10],[6,7,6,8],[6,9,6,10],[4,2,4,5],[5,2,5,5],[6,2,6,3],[6,4,6,5],[6,12,6,13]]}
[]
[]
[]
[null,null,{"$f":"Translations!G58","v":"Periodo"},"TOTAL",null,"←",null,null,null,null,null,null,null,null,null,null,null,null,null,null,{"$f":"Data!G6","v":"Meta"},null,false]
[null,null,{"$f":"IF(Indicators!$D$6=\"\",\"\",Indicators!$D$6)","v":"Tasa de ingreso por ventas"},null,null,null,null,{"$f":"IF(Indicators!$D$7=\"\",\"\",Indicators!$D$7)","v":"Tasa de cumplimiento de presupuesto"},null,null,null,null,{"$f":"IF(Indicators!$D$8=\"\",\"\",Indicators!$D$8)","v":"Tasa de endeudamiento"},null,null,null,null,{"$f":"IF(Indicators!$D$9=\"\",\"\",Indicators!$D$9)","v":"Número de procesos de capacitación"},null,null,null,null,{"$f":"HLOOKUP($D$4,Status!$Q$4:$R$27,2,FALSE)","v":-1}]
[null,null,{"$f":"IF(C5=\"\",\"\",HLOOKUP($D$4,Data!$H$4:$U$40,2,FALSE))","v":0.11749999999999999},null,null,null,null,{"$f":"IF(H5=\"\",\"\",HLOOKUP($D$4,Data!$H$4:$U$40,5,FALSE))","v":0},null,null,null,null,{"$f":"IF(M5=\"\",\"\",HLOOKUP($D$4,Data!$H$4:$U$40,8,FALSE))","v":0},null,null,null,null,{"$f":"IF(R5=\"\",\"\",HLOOKUP($D$4,Data!$H$4:$U$40,11,FALSE))","v":4},null,null,null,null,{"$f":"HLOOKUP($D$4,Status!$Q$4:$R$27,4,FALSE)","v":-1}]
[null,null,{"$f":"IF(C5=\"\",\"\",Data!$G$6)","v":"Meta"},null,{"$f":"IF(C5=\"\",\"\",HLOOKUP($D$4,Data!$H$4:$U$40,3,FALSE))","v":0.19999999999999998},null,null,{"$f":"IF(H5=\"\",\"\",Data!$G$6)","v":"Meta"},null,{"$f":"IF(H5=\"\",\"\",HLOOKUP($D$4,Data!$H$4:$U$40,6,FALSE))","v":0},null,null,{"$f":"IF(M5=\"\",\"\",Data!$G$6)","v":"Meta"},null,{"$f":"IF(M5=\"\",\"\",HLOOKUP($D$4,Data!$H$4:$U$40,9,FALSE))","v":0},null,null,{"$f":"IF(R5=\"\",\"\",Data!$G$6)","v":"Meta"},null,{"$f":"IF(R5=\"\",\"\",HLOOKUP($D$4,Data!$H$4:$U$40,12,FALSE))","v":5},null,null,{"$f":"HLOOKUP($D$4,Status!$Q$4:$R$27,6,FALSE)","v":1}]
[null,null,null,null,null,null,null,null,null,null,null,null,null,null,null,null,null,null,null,null,null,null,{"$f":"HLOOKUP($D$4,Status!$Q$4:$R$27,8,FALSE)","v":0}]
[null,null,null,null,null,null,null,null,null,null,null,null,null,null,null,null,null,null,null,null,null,null,{"$f":"HLOOKUP($D$4,Status!$Q$4:$R$27,10,FALSE)","v":-1}]
[null,null,null,null,null,null,null,null,null,null,null,null,null,null,null,null,null,null,null,null,null,null,{"$f":"HLOOKUP($D$4,Status!$Q$4:$R$27,12,FALSE)","v":1}]
[null,null,null,null,null,null,null,null,null,null,null,null,null,null,null,null,null,null,null,null,null,null,{"$f":"HLOOKUP($D$4,Status!$Q$4:$R$27,14,FALSE)","v":-1}]
[null,null,{"$f":"IF(Indicators!$D$10=\"\",\"\",Indicators!$D$10)","v":"Eficiencia del ciclo de producción"},null,null,null,null,{"$f":"IF(Indicators!$D$11=\"\",\"\",Indicators!$D$11)","v":"Tiempo de inactividad no planificada por TI"},null,null,null,null,{"$f":"IF(Indicators!$D$12=\"\",\"\",Indicators!$D$12)","v":"Tasa de mantenimientos preventivos a los equipos"},null,null,null,null,{"$f":"IF(Indicators!$D$13=\"\",\"\",Indicators!$D$13)","v":"Número de seguidores de FB"},null,null,null,null,{"$f":"HLOOKUP($D$4,Status!$Q$4:$R$27,16,FALSE)","v":0}]
[null,null,{"$f":"IF(C12=\"\",\"\",HLOOKUP($D$4,Data!$H$4:$U$40,14,FALSE))","v":0},null,null,null,null,{"$f":"IF(H12=\"\",\"\",HLOOKUP($D$4,Data!$H$4:$U$40,17,FALSE))","v":0},null,null,null,null,{"$f":"IF(M12=\"\",\"\",HLOOKUP($D$4,Data!$H$4:$U$40,20,FALSE))","v":0},null,null,null,null,{"$f":"IF(R12=\"\",\"\",HLOOKUP($D$4,Data!$H$4:$U$40,23,FALSE))","v":15348},null,null,null,null,{"$f":"HLOOKUP($D$4,Status!$Q$4:$R$27,18,FALSE)","v":-1}]
[null,null,{"$f":"IF(C12=\"\",\"\",Data!$G$6)","v":"Meta"},null,{"$f":"IF(C12=\"\",\"\",HLOOKUP($D$4,Data!$H$4:$U$40,15,FALSE))","v":0},null,null,{"$f":"IF(H12=\"\",\"\",Data!$G$6)","v":"Meta"},null,{"$f":"IF(H12=\"\",\"\",HLOOKUP($D$4,Data!$H$4:$U$40,18,FALSE))","v":0},null,null,{"$f":"IF(M12=\"\",\"\",Data!$G$6)","v":"Meta"},null,{"$f":"IF(M12=\"\",\"\",HLOOKUP($D$4,Data!$H$4:$U$40,21,FALSE))","v":0},null,null,{"$f":"IF(R12=\"\",\"\",Data!$G$6)","v":"Meta"},null,{"$f":"IF(R12=\"\",\"\",HLOOKUP($D$4,Data!$H$4:$U$40,24,FALSE))","v":16000},null,null,{"$f":"HLOOKUP($D$4,Status!$Q$4:$R$27,20,FALSE)","v":1}]
[null,null,null,null,null,null,null,null,null,null,null,null,null,null,null,null,null,null,null,null,null,null,{"$f":"HLOOKUP($D$4,Status!$Q$4:$R$27,22,FALSE)","v":1}]
[null,null,null,null,null,null,null,null,null,null,null,null,null,null,null,null,null,null,null,null,null,null,{"$f":"HLOOKUP($D$4,Status!$Q$4:$R$27,24,FALSE)","v":-1}]
[]
[]
[null,null,{"$f":"IF(Indicators!$D$14=\"\",\"\",Indicators!$D$14)","v":"Tasa de conversión de leads a clientes"},null,null,null,null,{"$f":"IF(Indicators!$D$15=\"\",\"\",Indicators!$D$15)","v":"Tiempo de resolución de quejas"},null,null,null,null,{"$f":"IF(Indicators!$D$16=\"\",\"\",Indicators!$D$16)","v":"Tasa de litigios evitados"},null,null,null,null,{"$f":"IF(Indicators!$D$17=\"\",\"\",Indicators!$D$17)","v":"Retorno de inversión de nuevos proyectos"}]
[null,null,{"$f":"IF(C19=\"\",\"\",HLOOKUP($D$4,Data!$H$4:$U$40,26,FALSE))","v":0},null,null,null,null,{"$f":"IF(H19=\"\",\"\",HLOOKUP($D$4,Data!$H$4:$U$40,29,FALSE))","v":0},null,null,null,null,{"$f":"IF(M19=\"\",\"\",HLOOKUP($D$4,Data!$H$4:$U$40,32,FALSE))","v":0},null,null,null,null,{"$f":"IF(R19=\"\",\"\",HLOOKUP($D$4,Data!$H$4:$U$40,35,FALSE))","v":0}]
[null,null,{"$f":"IF(C19=\"\",\"\",Data!$G$6)","v":"Meta"},null,{"$f":"IF(C19=\"\",\"\",HLOOKUP($D$4,Data!$H$4:$U$40,27,FALSE))","v":0},null,null,{"$f":"IF(H19=\"\",\"\",Data!$G$6)","v":"Meta"},null,{"$f":"IF(H19=\"\",\"\",HLOOKUP($D$4,Data!$H$4:$U$40,30,FALSE))","v":0},null,null,{"$f":"IF(M19=\"\",\"\",Data!$G$6)","v":"Meta"},null,{"$f":"IF(M19=\"\",\"\",HLOOKUP($D$4,Data!$H$4:$U$40,33,FALSE))","v":0},null,null,{"$f":"IF(R19=\"\",\"\",Data!$G$6)","v":"Meta"},null,{"$f":"IF(R19=\"\",\"\",HLOOKUP($D$4,Data!$H$4:$U$40,36,FALSE))","v":0}]

{"sheet":"Overview","index":5,"n_rows":28,"n_cols":9,"rows_kept":28,"cut":false,"hidden":false,"merged":[[19,7,20,7],[21,7,22,7],[23,7,24,7],[25,7,26,7],[27,7,28,7],[27,3,28,3],[27,4,28,4],[27,5,28,5],[27,6,28,6],[7,7,8,7],[9,7,10,7],[11,7,12,7],[13,7,14,7],[15,7,16,7],[17,7,18,7],[23,3,24,3],[23,4,24,4],[23,5,24,5],[23,6,24,6],[25,3,26,3],[25,4,26,4],[17,3,18,3],[17,4,18,4],[17,5,18,5],[17,6,18,6],[25,5,26,5],[25,6,26,6],[19,3,20,3],[19,4,20,4],[19,5,20,5],[19,6,20,6],[21,3,22,3],[21,4,22,4],[21,5,22,5],[21,6,22,6],[13,5,14,5],[13,6,14,6],[15,3,16,3],[15,4,16,4],[15,5,16,5],[15,6,16,6],[5,7,6,7],[7,3,8,3],[7,4,8,4],[7,5,8,5],[7,6,8,6],[5,4,6,4],[5,5,6,5],[5,6,6,6],[25,2,26,2],[27,2,28,2],[5,2,6,2],[7,2,8,2],[9,2,10,2],[11,2,12,2],[13,2,14,2],[15,2,16,2],[3,5,3,6],[17,2,18,2],[19,2,20,2],[21,2,22,2],[23,2,24,2],[5,3,6,3],[11,3,12,3],[11,4,12,4],[11,5,12,5],[11,6,12,6],[9,3,10,3],[9,4,10,4],[9,5,10,5],[9,6,10,6],[13,3,14,3],[13,4,14,4]]}
[]
[]
[]
[null,null,null,null,null,{"$f":"Translations!G58","v":"Periodo"},null,"TOTAL","←"]
[null,null,{"$f":"Data!D4","v":"Nombre del indicador"},{"$f":"Translations!G26","v":"Actual"},{"$f":"Translations!G28","v":"Meta"},{"$f":"Translations!G27","v":"% Objetivo"},{"$f":"Translations!G61","v":"Status"},{"$f":"Translations!G62","v":"Tendencia"}]
[null,null,{"$f":"IF(Indicators!D6=\"\",\"\",Indicators!D6)","v":"Tasa de ingreso por ventas"},{"$f":"IF(C6=\"\",\"\",HLOOKUP($H$4,Data!$H$4:$U$40,2,FALSE))","v":0.11749999999999999},{"$f":"IF(D6=\"\",\"\",HLOOKUP($H$4,Data!$H$4:$U$40,3,FALSE))","v":0.19999999999999998},{"$f":"IFERROR(IF(C6=\"\",\"\",D6/E6),0)","v":0.58750000000000002},{"$f":"IF(C6=\"\",\"\",HLOOKUP($H$4,Status!$D$4:$R$28,2,FALSE))","v":-1}]
[]
[null,null,{"$f":"IF(Indicators!D7=\"\",\"\",Indicators!D7)","v":"Tasa de cumplimiento de presupuesto"},{"$f":"IF(C8=\"\",\"\",HLOOKUP($H$4,Data!$H$4:$U$40,5,FALSE))","v":0},{"$f":"IF(D8=\"\",\"\",HLOOKUP($H$4,Data!$H$4:$U$40,6,FALSE))","v":0},{"$f":"IFERROR(IF(C8=\"\",\"\",D8/E8),0)","v":0},{"$f":"IF(C8=\"\",\"\",HLOOKUP($H$4,Status!$D$4:$R$28,4,FALSE))","v":-1}]
[]
[null,null,{"$f":"IF(Indicators!D8=\"\",\"\",Indicators!D8)","v":"Tasa de endeudamiento"},{"$f":"IF(C10=\"\",\"\",HLOOKUP($H$4,Data!$H$4:$U$40,8,FALSE))","v":0},{"$f":"IF(D10=\"\",\"\",HLOOKUP($H$4,Data!$H$4:$U$40,9,FALSE))","v":0},{"$f":"IFERROR(IF(C10=\"\",\"\",D10/E10),0)","v":0},{"$f":"IF(C10=\"\",\"\",HLOOKUP($H$4,Status!$D$4:$R$28,6,FALSE))","v":1}]
[]
[null,null,{"$f":"IF(Indicators!D9=\"\",\"\",Indicators!D9)","v":"Número de procesos de capacitación"},{"$f":"IF(C12=\"\",\"\",HLOOKUP($H$4,Data!$H$4:$U$40,11,FALSE))","v":4},{"$f":"IF(D12=\"\",\"\",HLOOKUP($H$4,Data!$H$4:$U$40,12,FALSE))","v":5},{"$f":"IFERROR(IF(C12=\"\",\"\",D12/E12),0)","v":0.8},{"$f":"IF(C12=\"\",\"\",HLOOKUP($H$4,Status!$D$4:$R$28,8,FALSE))","v":0}]
[]
[null,null,{"$f":"IF(Indicators!D10=\"\",\"\",Indicators!D10)","v":"Eficiencia del ciclo de producción"},{"$f":"IF(C14=\"\",\"\",HLOOKUP($H$4,Data!$H$4:$U$40,14,FALSE))","v":0},{"$f":"IF(D14=\"\",\"\",HLOOKUP($H$4,Data!$H$4:$U$40,15,FALSE))","v":0},{"$f":"IFERROR(IF(C14=\"\",\"\",D14/E14),0)","v":0},{"$f":"IF(C14=\"\",\"\",HLOOKUP($H$4,Status!$D$4:$R$28,10,FALSE))","v":-1}]
[]
[null,null,{"$f":"IF(Indicators!D11=\"\",\"\",Indicators!D11)","v":"Tiempo de inactividad no planificada por TI"},{"$f":"IF(C16=\"\",\"\",HLOOKUP($H$4,Data!$H$4:$U$40,17,FALSE))","v":0},{"$f":"IF(D16=\"\",\"\",HLOOKUP($H$4,Data!$H$4:$U$40,18,FALSE))","v":0},{"$f":"IFERROR(IF(C16=\"\",\"\",D16/E16),0)","v":0},{"$f":"IF(C16=\"\",\"\",HLOOKUP($H$4,Status!$D$4:$R$28,12,FALSE))","v":1}]
[]
[null,null,{"$f":"IF(Indicators!D12=\"\",\"\",Indicators!D12)","v":"Tasa de mantenimientos preventivos a los equipos"},{"$f":"IF(C18=\"\",\"\",HLOOKUP($H$4,Data!$H$4:$U$40,20,FALSE))","v":0},{"$f":"IF(D18=\"\",\"\",HLOOKUP($H$4,Data!$H$4:$U$40,21,FALSE))","v":0},{"$f":"IFERROR(IF(C18=\"\",\"\",D18/E18),0)","v":0},{"$f":"IF(C18=\"\",\"\",HLOOKUP($H$4,Status!$D$4:$R$28,14,FALSE))","v":-1}]
[]
[null,null,{"$f":"IF(Indicators!D13=\"\",\"\",Indicators!D13)","v":"Número de seguidores de FB"},{"$f":"IF(C20=\"\",\"\",HLOOKUP($H$4,Data!$H$4:$U$40,23,FALSE))","v":15348},{"$f":"IF(D20=\"\",\"\",HLOOKUP($H$4,Data!$H$4:$U$40,24,FALSE))","v":16000},{"$f":"IFERROR(IF(C20=\"\",\"\",D20/E20),0)","v":0.95925000000000005},{"$f":"IF(C20=\"\",\"\",HLOOKUP($H$4,Status!$D$4:$R$28,16,FALSE))","v":0}]
[]
[null,null,{"$f":"IF(Indicators!D14=\"\",\"\",Indicators!D14)","v":"Tasa de conversión de leads a clientes"},{"$f":"IF(C22=\"\",\"\",HLOOKUP($H$4,Data!$H$4:$U$40,26,FALSE))","v":0},{"$f":"IF(D22=\"\",\"\",HLOOKUP($H$4,Data!$H$4:$U$40,27,FALSE))","v":0},{"$f":"IFERROR(IF(C22=\"\",\"\",D22/E22),0)","v":0},{"$f":"IF(C22=\"\",\"\",HLOOKUP($H$4,Status!$D$4:$R$28,18,FALSE))","v":-1}]
[]
[null,null,{"$f":"IF(Indicators!D15=\"\",\"\",Indicators!D15)","v":"Tiempo de resolución de quejas"},{"$f":"IF(C24=\"\",\"\",HLOOKUP($H$4,Data!$H$4:$U$40,29,FALSE))","v":0},{"$f":"IF(D24=\"\",\"\",HLOOKUP($H$4,Data!$H$4:$U$40,30,FALSE))","v":0},{"$f":"IFERROR(IF(C24=\"\",\"\",D24/E24),0)","v":0},{"$f":"IF(C24=\"\",\"\",HLOOKUP($H$4,Status!$D$4:$R$28,20,FALSE))","v":1}]
[]
[null,null,{"$f":"IF(Indicators!D16=\"\",\"\",Indicators!D16)","v":"Tasa de litigios evitados"},{"$f":"IF(C26=\"\",\"\",HLOOKUP($H$4,Data!$H$4:$U$40,32,FALSE))","v":0},{"$f":"IF(D26=\"\",\"\",HLOOKUP($H$4,Data!$H$4:$U$40,33,FALSE))","v":0},{"$f":"IFERROR(IF(C26=\"\",\"\",D26/E26),0)","v":0},{"$f":"IF(C26=\"\",\"\",HLOOKUP($H$4,Status!$D$4:$R$28,22,FALSE))","v":1}]
[]
[null,null,{"$f":"IF(Indicators!D17=\"\",\"\",Indicators!D17)","v":"Retorno de inversión de nuevos proyectos"},{"$f":"IF(C28=\"\",\"\",HLOOKUP($H$4,Data!$H$4:$U$40,35,FALSE))","v":0},{"$f":"IF(D28=\"\",\"\",HLOOKUP($H$4,Data!$H$4:$U$40,36,FALSE))","v":0},{"$f":"IFERROR(IF(C28=\"\",\"\",D28/E28),0)","v":0},{"$f":"IF(C28=\"\",\"\",HLOOKUP($H$4,Status!$D$4:$R$28,24,FALSE))","v":-1}]

{"sheet":"Status","index":6,"n_rows":27,"n_cols":20,"rows_kept":27,"cut":false,"hidden":false,"merged":[[4,16,5,16],[4,17,5,17],[4,2,5,2],[6,2,7,2],[6,3,7,3],[6,4,7,4],[6,5,7,5],[6,6,7,6],[6,7,7,7],[6,8,7,8],[4,9,5,9],[4,10,5,10],[4,11,5,11],[4,12,5,12],[4,13,5,13],[4,14,5,14],[4,3,5,3],[4,4,5,4],[4,5,5,5],[4,6,5,6],[4,7,5,7],[4,8,5,8],[8,14,9,14],[8,16,9,16],[8,17,9,17],[6,16,7,16],[6,17,7,17],[8,3,9,3],[8,4,9,4],[8,5,9,5],[8,6,9,6],[8,7,9,7],[8,8,9,8],[8,9,9,9],[8,10,9,10],[6,9,7,9],[6,10,7,10],[6,11,7,11],[6,12,7,12],[6,13,7,13],[6,14,7,14],[8,2,9,2],[10,2,11,2],[10,3,11,3],[10,4,11,4],[10,5,11,5],[10,6,11,6],[8,11,9,11],[8,12,9,12],[8,13,9,13],[10,13,11,13],[12,8,13,8],[12,9,13,9],[10,14,11,14],[10,16,11,16],[10,17,11,17],[12,2,13,2],[12,3,13,3],[12,4,13,4],[12,5,13,5],[12,6,13,6],[12,7,13,7],[10,7,11,7],[10,8,11,8],[10,9,11,9],[10,10,11,10],[10,11,11,11],[10,12,11,12],[12,14,13,14],[12,16,13,16],[12,17,13,17],[12,10,13,10],[12,11,13,11],[12,12,13,12],[12,13,13,13],[14,17,15,17],[16,2,17,2],[16,3,17,3],[16,4,17,4],[16,5,17,5],[16,6,17,6],[16,7,17,7],[16,8,17,8],[16,9,17,9],[14,8,15,8],[14,10,15,10],[14,11,15,11],[14,12,15,12],[14,13,15,13],[14,14,15,14],[14,2,15,2],[14,3,15,3],[14,4,15,4],[14,5,15,5],[14,6,15,6],[14,7,15,7],[14,9,15,9],[16,17,17,17],[14,16,15,16],[18,17,19,17],[22,10,23,10],[22,11,23,11],[22,12,23,12],[22,13,23,13],[22,14,23,14],[18,2,19,2],[18,3,19,3],[18,4,19,4],[18,5,19,5],[18,6,19,6],[18,8,19,8],[18,7,19,7],[18,9,19,9],[18,10,19,10],[20,17,21,17],[22,2,23,2],[22,3,23,3],[22,4,23,4],[22,6,23,6],[22,5,23,5],[22,7,23,7],[22,8,23,8],[20,8,21,8],[20,9,21,9],[20,10,21,10],[20,11,21,11],[20,12,21,12],[20,13,21,13],[20,3,21,3],[20,4,21,4],[20,5,21,5],[20,2,21,2],[20,6,21,6],[20,7,21,7],[22,17,23,17],[26,17,27,17],[26,2,27,2],[24,17,25,17],[26,3,27,3],[26,4,27,4],[26,5,27,5],[26,7,27,7],[26,6,27,6],[26,8,27,8],[26,9,27,9],[26,10,27,10],[26,11,27,11],[24,10,25,10],[24,11,25,11],[24,12,25,12],[24,13,25,13],[24,14,25,14],[24,16,25,16],[24,2,25,2],[24,3,25,3],[24,7,25,7],[24,9,25,9],[24,4,25,4],[24,5,25,5],[24,6,25,6],[24,8,25,8],[26,12,27,12],[26,13,27,13],[26,14,27,14],[26,16,27,16],[22,9,23,9],[22,16,23,16],[20,14,21,14],[20,16,21,16],[16,10,17,10],[16,11,17,11],[16,12,17,12],[16,13,17,13],[16,14,17,14],[16,16,17,16],[18,11,19,11],[18,12,19,12],[18,13,19,13],[18,14,19,14],[18,16,19,16]]}
[]
[null,null,null,null,null,null,null,null,null,null,null,null,null,null,null,null,null,null,null,{"$f":"Settings!$F$11","v":1}]
[null,null,null,null,null,null,null,null,null,null,null,null,null,null,null,null,null,null,null,{"$f":"Settings!$F$12","v":0.8}]
[null,null,{"$f":"Indicators!D5","v":"Nombre del indicador"},{"$f":"Data!H4","v":"ENE"},{"$f":"Data!I4","v":"FEB"},{"$f":"Data!J4","v":"MAR"},{"$f":"Data!K4","v":"ABR"},{"$f":"Data!L4","v":"MAY"},{"$f":"Data!M4","v":"JUN"},{"$f":"Data!N4","v":"JUL"},{"$f":"Data!O4","v":"AGO"},{"$f":"Data!P4","v":"SEP"},{"$f":"Data!Q4","v":"OCT"},{"$f":"Data!R4","v":"NOV"},{"$f":"Data!S4","v":"DIC"},null,{"$f":"Data!T4","v":"ACUM"},{"$f":"Data!U4","v":"Total"}]
[null,null,{"$f":"IF(Indicators!D6=\"\",\"\",Indicators!D6)","v":"Tasa de ingreso por ventas"},{"$f":"IF($C5=\"\",\"\",IF(Data!H5=\"\",\"\",IF(AND(Data!H7<Status!$T$3,Status!$T5=\"↑\"),-1,IF(AND(Data!H7<Status!$T$2,Status!$T5=\"↑\"),0,IF(AND(Data!H7>=Status!$T$2,Status!$T5=\"↑\"),1,IF(AND(Data!H7>Status!$T$1,Status!$T5=\"↓\"),-1,IF(AND(Data!H7>=Status!$T$2,Status!$T5=\"↓\"),0,IF(AND(Data!H7<=Status!$T$2,Status!$T5=\"↓\"),1))))))))","v":0},{"$f":"IF($C5=\"\",\"\",IF(Data!I5=\"\",\"\",IF(AND(Data!I7<Status!$T$3,Status!$T5=\"↑\"),-1,IF(AND(Data!I7<Status!$T$2,Status!$T5=\"↑\"),0,IF(AND(Data!I7>=Status!$T$2,Status!$T5=\"↑\"),1,IF(AND(Data!I7>Status!$T$1,Status!$T5=\"↓\"),-1,IF(AND(Data!I7>=Status!$T$2,Status!$T5=\"↓\"),0,IF(AND(Data!I7<=Status!$T$2,Status!$T5=\"↓\"),1))))))))","v":-1},{"$f":"IF($C5=\"\",\"\",IF(Data!J5=\"\",\"\",IF(AND(Data!J7<Status!$T$3,Status!$T5=\"↑\"),-1,IF(AND(Data!J7<Status!$T$2,Status!$T5=\"↑\"),0,IF(AND(Data!J7>=Status!$T$2,Status!$T5=\"↑\"),1,IF(AND(Data!J7>Status!$T$1,Status!$T5=\"↓\"),-1,IF(AND(Data!J7>=Status!$T$2,Status!$T5=\"↓\"),0,IF(AND(Data!J7<=Status!$T$2,Status!$T5=\"↓\"),1))))))))","v":-1},{"$f":"IF($C5=\"\",\"\",IF(Data!K5=\"\",\"\",IF(AND(Data!K7<Status!$T$3,Status!$T5=\"↑\"),-1,IF(AND(Data!K7<Status!$T$2,Status!$T5=\"↑\"),0,IF(AND(Data!K7>=Status!$T$2,Status!$T5=\"↑\"),1,IF(AND(Data!K7>Status!$T$1,Status!$T5=\"↓\"),-1,IF(AND(Data!K7>=Status!$T$2,Status!$T5=\"↓\"),0,IF(AND(Data!K7<=Status!$T$2,Status!$T5=\"↓\"),1))))))))","v":-1},{"$f":"IF($C5=\"\",\"\",IF(Data!L5=\"\",\"\",IF(AND(Data!L7<Status!$T$3,Status!$T5=\"↑\"),-1,IF(AND(Data!L7<Status!$T$2,Status!$T5=\"↑\"),0,IF(AND(Data!L7>=Status!$T$2,Status!$T5=\"↑\"),1,IF(AND(Data!L7>Status!$T$1,Status!$T5=\"↓\"),-1,IF(AND(Data!L7>=Status!$T$2,Status!$T5=\"↓\"),0,IF(AND(Data!L7<=Status!$T$2,Status!$T5=\"↓\"),1))))))))","v":1},{"$f":"IF($C5=\"\",\"\",IF(Data!M5=\"\",\"\",IF(AND(Data!M7<Status!$T$3,Status!$T5=\"↑\"),-1,IF(AND(Data!M7<Status!$T$2,Status!$T5=\"↑\"),0,IF(AND(Data!M7>=Status!$T$2,Status!$T5=\"↑\"),1,IF(AND(Data!M7>Status!$T$1,Status!$T5=\"↓\"),-1,IF(AND(Data!M7>=Status!$T$2,Status!$T5=\"↓\"),0,IF(AND(Data!M7<=Status!$T$2,Status!$T5=\"↓\"),1))))))))","v":-1},{"$f":"IF($C5=\"\",\"\",IF(Data!N5=\"\",\"\",IF(AND(Data!N7<Status!$T$3,Status!$T5=\"↑\"),-1,IF(AND(Data!N7<Status!$T$2,Status!$T5=\"↑\"),0,IF(AND(Data!N7>=Status!$T$2,Status!$T5=\"↑\"),1,IF(AND(Data!N7>Status!$T$1,Status!$T5=\"↓\"),-1,IF(AND(Data!N7>=Status!$T$2,Status!$T5=\"↓\"),0,IF(AND(Data!N7<=Status!$T$2,Status!$T5=\"↓\"),1))))))))","v":-1},{"$f":"IF($C5=\"\",\"\",IF(Data!O5=\"\",\"\",IF(AND(Data!O7<Status!$T$3,Status!$T5=\"↑\"),-1,IF(AND(Data!O7<Status!$T$2,Status!$T5=\"↑\"),0,IF(AND(Data!O7>=Status!$T$2,Status!$T5=\"↑\"),1,IF(AND(Data!O7>Status!$T$1,Status!$T5=\"↓\"),-1,IF(AND(Data!O7>=Status!$T$2,Status!$T5=\"↓\"),0,IF(AND(Data!O7<=Status!$T$2,Status!$T5=\"↓\"),1))))))))","v":-1},{"$f":"IF($C5=\"\",\"\",IF(Data!P5=\"\",\"\",IF(AND(Data!P7<Status!$T$3,Status!$T5=\"↑\"),-1,IF(AND(Data!P7<Status!$T$2,Status!$T5=\"↑\"),0,IF(AND(Data!P7>=Status!$T$2,Status!$T5=\"↑\"),1,IF(AND(Data!P7>Status!$T$1,Status!$T5=\"↓\"),-1,IF(AND(Data!P7>=Status!$T$2,Status!$T5=\"↓\"),0,IF(AND(Data!P7<=Status!$T$2,Status!$T5=\"↓\"),1))))))))","v":""},{"$f":"IF($C5=\"\",\"\",IF(Data!Q5=\"\",\"\",IF(AND(Data!Q7<Status!$T$3,Status!$T5=\"↑\"),-1,IF(AND(Data!Q7<Status!$T$2,Status!$T5=\"↑\"),0,IF(AND(Data!Q7>=Status!$T$2,Status!$T5=\"↑\"),1,IF(AND(Data!Q7>Status!$T$1,Status!$T5=\"↓\"),-1,IF(AND(Data!Q7>=Status!$T$2,Status!$T5=\"↓\"),0,IF(AND(Data!Q7<=Status!$T$2,Status!$T5=\"↓\"),1))))))))","v":""},{"$f":"IF($C5=\"\",\"\",IF(Data!R5=\"\",\"\",IF(AND(Data!R7<Status!$T$3,Status!$T5=\"↑\"),-1,IF(AND(Data!R7<Status!$T$2,Status!$T5=\"↑\"),0,IF(AND(Data!R7>=Status!$T$2,Status!$T5=\"↑\"),1,IF(AND(Data!R7>Status!$T$1,Status!$T5=\"↓\"),-1,IF(AND(Data!R7>=Status!$T$2,Status!$T5=\"↓\"),0,IF(AND(Data!R7<=Status!$T$2,Status!$T5=\"↓\"),1))))))))","v":""},{"$f":"IF($C5=\"\",\"\",IF(Data!S5=\"\",\"\",IF(AND(Data!S7<Status!$T$3,Status!$T5=\"↑\"),-1,IF(AND(Data!S7<Status!$T$2,Status!$T5=\"↑\"),0,IF(AND(Data!S7>=Status!$T$2,Status!$T5=\"↑\"),1,IF(AND(Data!S7>Status!$T$1,Status!$T5=\"↓\"),-1,IF(AND(Data!S7>=Status!$T$2,Status!$T5=\"↓\"),0,IF(AND(Data!S7<=Status!$T$2,Status!$T5=\"↓\"),1))))))))","v":""},null,{"$f":"IF($C5=\"\",\"\",IF(Data!T5=\"\",\"\",IF(AND(Data!T7<Status!$T$3,Status!$T5=\"↑\"),-1,IF(AND(Data!T7<Status!$T$2,Status!$T5=\"↑\"),0,IF(AND(Data!T7>=Status!$T$2,Status!$T5=\"↑\"),1,IF(AND(Data!T7>Status!$T$1,Status!$T5=\"↓\"),-1,IF(AND(Data!T7>=Status!$T$2,Status!$T5=\"↓\"),0,IF(AND(Data!T7<=Status!$T$2,Status!$T5=\"↓\"),1))))))))","v":-1},{"$f":"IF($C5=\"\",\"\",IF(Data!U5=\"\",\"\",IF(AND(Data!U7<Status!$T$3,Status!$T5=\"↑\"),-1,IF(AND(Data!U7<Status!$T$2,Status!$T5=\"↑\"),0,IF(AND(Data!U7>=Status!$T$2,Status!$T5=\"↑\"),1,IF(AND(Data!U7>Status!$T$1,Status!$T5=\"↓\"),-1,IF(AND(Data!U7>=Status!$T$2,Status!$T5=\"↓\"),0,IF(AND(Data!U7<=Status!$T$2,Status!$T5=\"↓\"),1))))))))","v":-1},null,{"$f":"Indicators!H6","v":"↑"}]
[]
[null,null,{"$f":"IF(Indicators!D7=\"\",\"\",Indicators!D7)","v":"Tasa de cumplimiento de presupuesto"},{"$f":"IF($C7=\"\",\"\",IF(Data!H8=\"\",\"\",IF(AND(Data!H10<Status!$T$3,Status!$T7=\"↑\"),-1,IF(AND(Data!H10<Status!$T$2,Status!$T7=\"↑\"),0,IF(AND(Data!H10>=Status!$T$2,Status!$T7=\"↑\"),1,IF(AND(Data!H10>Status!$T$1,Status!$T7=\"↓\"),-1,IF(AND(Data!H10>=Status!$T$2,Status!$T7=\"↓\"),0,IF(AND(Data!H10<=Status!$T$2,Status!$T7=\"↓\"),1))))))))","v":""},{"$f":"IF($C7=\"\",\"\",IF(Data!I8=\"\",\"\",IF(AND(Data!I10<Status!$T$3,Status!$T7=\"↑\"),-1,IF(AND(Data!I10<Status!$T$2,Status!$T7=\"↑\"),0,IF(AND(Data!I10>=Status!$T$2,Status!$T7=\"↑\"),1,IF(AND(Data!I10>Status!$T$1,Status!$T7=\"↓\"),-1,IF(AND(Data!I10>=Status!$T$2,Status!$T7=\"↓\"),0,IF(AND(Data!I10<=Status!$T$2,Status!$T7=\"↓\"),1))))))))","v":""},{"$f":"IF($C7=\"\",\"\",IF(Data!J8=\"\",\"\",IF(AND(Data!J10<Status!$T$3,Status!$T7=\"↑\"),-1,IF(AND(Data!J10<Status!$T$2,Status!$T7=\"↑\"),0,IF(AND(Data!J10>=Status!$T$2,Status!$T7=\"↑\"),1,IF(AND(Data!J10>Status!$T$1,Status!$T7=\"↓\"),-1,IF(AND(Data!J10>=Status!$T$2,Status!$T7=\"↓\"),0,IF(AND(Data!J10<=Status!$T$2,Status!$T7=\"↓\"),1))))))))","v":""},{"$f":"IF($C7=\"\",\"\",IF(Data!K8=\"\",\"\",IF(AND(Data!K10<Status!$T$3,Status!$T7=\"↑\"),-1,IF(AND(Data!K10<Status!$T$2,Status!$T7=\"↑\"),0,IF(AND(Data!K10>=Status!$T$2,Status!$T7=\"↑\"),1,IF(AND(Data!K10>Status!$T$1,Status!$T7=\"↓\"),-1,IF(AND(Data!K10>=Status!$T$2,Status!$T7=\"↓\"),0,IF(AND(Data!K10<=Status!$T$2,Status!$T7=\"↓\"),1))))))))","v":""},{"$f":"IF($C7=\"\",\"\",IF(Data!L8=\"\",\"\",IF(AND(Data!L10<Status!$T$3,Status!$T7=\"↑\"),-1,IF(AND(Data!L10<Status!$T$2,Status!$T7=\"↑\"),0,IF(AND(Data!L10>=Status!$T$2,Status!$T7=\"↑\"),1,IF(AND(Data!L10>Status!$T$1,Status!$T7=\"↓\"),-1,IF(AND(Data!L10>=Status!$T$2,Status!$T7=\"↓\"),0,IF(AND(Data!L10<=Status!$T$2,Status!$T7=\"↓\"),1))))))))","v":""},{"$f":"IF($C7=\"\",\"\",IF(Data!M8=\"\",\"\",IF(AND(Data!M10<Status!$T$3,Status!$T7=\"↑\"),-1,IF(AND(Data!M10<Status!$T$2,Status!$T7=\"↑\"),0,IF(AND(Data!M10>=Status!$T$2,Status!$T7=\"↑\"),1,IF(AND(Data!M10>Status!$T$1,Status!$T7=\"↓\"),-1,IF(AND(Data!M10>=Status!$T$2,Status!$T7=\"↓\"),0,IF(AND(Data!M10<=Status!$T$2,Status!$T7=\"↓\"),1))))))))","v":""},{"$f":"IF($C7=\"\",\"\",IF(Data!N8=\"\",\"\",IF(AND(Data!N10<Status!$T$3,Status!$T7=\"↑\"),-1,IF(AND(Data!N10<Status!$T$2,Status!$T7=\"↑\"),0,IF(AND(Data!N10>=Status!$T$2,Status!$T7=\"↑\"),1,IF(AND(Data!N10>Status!$T$1,Status!$T7=\"↓\"),-1,IF(AND(Data!N10>=Status!$T$2,Status!$T7=\"↓\"),0,IF(AND(Data!N10<=Status!$T$2,Status!$T7=\"↓\"),1))))))))","v":""},{"$f":"IF($C7=\"\",\"\",IF(Data!O8=\"\",\"\",IF(AND(Data!O10<Status!$T$3,Status!$T7=\"↑\"),-1,IF(AND(Data!O10<Status!$T$2,Status!$T7=\"↑\"),0,IF(AND(Data!O10>=Status!$T$2,Status!$T7=\"↑\"),1,IF(AND(Data!O10>Status!$T$1,Status!$T7=\"↓\"),-1,IF(AND(Data!O10>=Status!$T$2,Status!$T7=\"↓\"),0,IF(AND(Data!O10<=Status!$T$2,Status!$T7=\"↓\"),1))))))))","v":""},{"$f":"IF($C7=\"\",\"\",IF(Data!P8=\"\",\"\",IF(AND(Data!P10<Status!$T$3,Status!$T7=\"↑\"),-1,IF(AND(Data!P10<Status!$T$2,Status!$T7=\"↑\"),0,IF(AND(Data!P10>=Status!$T$2,Status!$T7=\"↑\"),1,IF(AND(Data!P10>Status!$T$1,Status!$T7=\"↓\"),-1,IF(AND(Data!P10>=Status!$T$2,Status!$T7=\"↓\"),0,IF(AND(Data!P10<=Status!$T$2,Status!$T7=\"↓\"),1))))))))","v":""},{"$f":"IF($C7=\"\",\"\",IF(Data!Q8=\"\",\"\",IF(AND(Data!Q10<Status!$T$3,Status!$T7=\"↑\"),-1,IF(AND(Data!Q10<Status!$T$2,Status!$T7=\"↑\"),0,IF(AND(Data!Q10>=Status!$T$2,Status!$T7=\"↑\"),1,IF(AND(Data!Q10>Status!$T$1,Status!$T7=\"↓\"),-1,IF(AND(Data!Q10>=Status!$T$2,Status!$T7=\"↓\"),0,IF(AND(Data!Q10<=Status!$T$2,Status!$T7=\"↓\"),1))))))))","v":""},{"$f":"IF($C7=\"\",\"\",IF(Data!R8=\"\",\"\",IF(AND(Data!R10<Status!$T$3,Status!$T7=\"↑\"),-1,IF(AND(Data!R10<Status!$T$2,Status!$T7=\"↑\"),0,IF(AND(Data!R10>=Status!$T$2,Status!$T7=\"↑\"),1,IF(AND(Data!R10>Status!$T$1,Status!$T7=\"↓\"),-1,IF(AND(Data!R10>=Status!$T$2,Status!$T7=\"↓\"),0,IF(AND(Data!R10<=Status!$T$2,Status!$T7=\"↓\"),1))))))))","v":""},{"$f":"IF($C7=\"\",\"\",IF(Data!S8=\"\",\"\",IF(AND(Data!S10<Status!$T$3,Status!$T7=\"↑\"),-1,IF(AND(Data!S10<Status!$T$2,Status!$T7=\"↑\"),0,IF(AND(Data!S10>=Status!$T$2,Status!$T7=\"↑\"),1,IF(AND(Data!S10>Status!$T$1,Status!$T7=\"↓\"),-1,IF(AND(Data!S10>=Status!$T$2,Status!$T7=\"↓\"),0,IF(AND(Data!S10<=Status!$T$2,Status!$T7=\"↓\"),1))))))))","v":""},null,{"$f":"IF($C7=\"\",\"\",IF(Data!T8=\"\",\"\",IF(AND(Data!T10<Status!$T$3,Status!$T7=\"↑\"),-1,IF(AND(Data!T10<Status!$T$2,Status!$T7=\"↑\"),0,IF(AND(Data!T10>=Status!$T$2,Status!$T7=\"↑\"),1,IF(AND(Data!T10>Status!$T$1,Status!$T7=\"↓\"),-1,IF(AND(Data!T10>=Status!$T$2,Status!$T7=\"↓\"),0,IF(AND(Data!T10<=Status!$T$2,Status!$T7=\"↓\"),1))))))))","v":-1},{"$f":"IF($C7=\"\",\"\",IF(Data!U8=\"\",\"\",IF(AND(Data!U10<Status!$T$3,Status!$T7=\"↑\"),-1,IF(AND(Data!U10<Status!$T$2,Status!$T7=\"↑\"),0,IF(AND(Data!U10>=Status!$T$2,Status!$T7=\"↑\"),1,IF(AND(Data!U10>Status!$T$1,Status!$T7=\"↓\"),-1,IF(AND(Data!U10>=Status!$T$2,Status!$T7=\"↓\"),0,IF(AND(Data!U10<=Status!$T$2,Status!$T7=\"↓\"),1))))))))","v":-1},null,{"$f":"Indicators!H7","v":"↑"}]
[]
[null,null,{"$f":"IF(Indicators!D8=\"\",\"\",Indicators!D8)","v":"Tasa de endeudamiento"},{"$f":"IF($C9=\"\",\"\",IF(Data!H11=\"\",\"\",IF(AND(Data!H13<Status!$T$3,Status!$T9=\"↑\"),-1,IF(AND(Data!H13<Status!$T$2,Status!$T9=\"↑\"),0,IF(AND(Data!H13>=Status!$T$2,Status!$T9=\"↑\"),1,IF(AND(Data!H13>Status!$T$1,Status!$T9=\"↓\"),-1,IF(AND(Data!H13>=Status!$T$2,Status!$T9=\"↓\"),0,IF(AND(Data!H13<=Status!$T$2,Status!$T9=\"↓\"),1))))))))","v":""},{"$f":"IF($C9=\"\",\"\",IF(Data!I11=\"\",\"\",IF(AND(Data!I13<Status!$T$3,Status!$T9=\"↑\"),-1,IF(AND(Data!I13<Status!$T$2,Status!$T9=\"↑\"),0,IF(AND(Data!I13>=Status!$T$2,Status!$T9=\"↑\"),1,IF(AND(Data!I13>Status!$T$1,Status!$T9=\"↓\"),-1,IF(AND(Data!I13>=Status!$T$2,Status!$T9=\"↓\"),0,IF(AND(Data!I13<=Status!$T$2,Status!$T9=\"↓\"),1))))))))","v":""},{"$f":"IF($C9=\"\",\"\",IF(Data!J11=\"\",\"\",IF(AND(Data!J13<Status!$T$3,Status!$T9=\"↑\"),-1,IF(AND(Data!J13<Status!$T$2,Status!$T9=\"↑\"),0,IF(AND(Data!J13>=Status!$T$2,Status!$T9=\"↑\"),1,IF(AND(Data!J13>Status!$T$1,Status!$T9=\"↓\"),-1,IF(AND(Data!J13>=Status!$T$2,Status!$T9=\"↓\"),0,IF(AND(Data!J13<=Status!$T$2,Status!$T9=\"↓\"),1))))))))","v":""},{"$f":"IF($C9=\"\",\"\",IF(Data!K11=\"\",\"\",IF(AND(Data!K13<Status!$T$3,Status!$T9=\"↑\"),-1,IF(AND(Data!K13<Status!$T$2,Status!$T9=\"↑\"),0,IF(AND(Data!K13>=Status!$T$2,Status!$T9=\"↑\"),1,IF(AND(Data!K13>Status!$T$1,Status!$T9=\"↓\"),-1,IF(AND(Data!K13>=Status!$T$2,Status!$T9=\"↓\"),0,IF(AND(Data!K13<=Status!$T$2,Status!$T9=\"↓\"),1))))))))","v":""},{"$f":"IF($C9=\"\",\"\",IF(Data!L11=\"\",\"\",IF(AND(Data!L13<Status!$T$3,Status!$T9=\"↑\"),-1,IF(AND(Data!L13<Status!$T$2,Status!$T9=\"↑\"),0,IF(AND(Data!L13>=Status!$T$2,Status!$T9=\"↑\"),1,IF(AND(Data!L13>Status!$T$1,Status!$T9=\"↓\"),-1,IF(AND(Data!L13>=Status!$T$2,Status!$T9=\"↓\"),0,IF(AND(Data!L13<=Status!$T$2,Status!$T9=\"↓\"),1))))))))","v":""},{"$f":"IF($C9=\"\",\"\",IF(Data!M11=\"\",\"\",IF(AND(Data!M13<Status!$T$3,Status!$T9=\"↑\"),-1,IF(AND(Data!M13<Status!$T$2,Status!$T9=\"↑\"),0,IF(AND(Data!M13>=Status!$T$2,Status!$T9=\"↑\"),1,IF(AND(Data!M13>Status!$T$1,Status!$T9=\"↓\"),-1,IF(AND(Data!M13>=Status!$T$2,Status!$T9=\"↓\"),0,IF(AND(Data!M13<=Status!$T$2,Status!$T9=\"↓\"),1))))))))","v":""},{"$f":"IF($C9=\"\",\"\",IF(Data!N11=\"\",\"\",IF(AND(Data!N13<Status!$T$3,Status!$T9=\"↑\"),-1,IF(AND(Data!N13<Status!$T$2,Status!$T9=\"↑\"),0,IF(AND(Data!N13>=Status!$T$2,Status!$T9=\"↑\"),1,IF(AND(Data!N13>Status!$T$1,Status!$T9=\"↓\"),-1,IF(AND(Data!N13>=Status!$T$2,Status!$T9=\"↓\"),0,IF(AND(Data!N13<=Status!$T$2,Status!$T9=\"↓\"),1))))))))","v":""},{"$f":"IF($C9=\"\",\"\",IF(Data!O11=\"\",\"\",IF(AND(Data!O13<Status!$T$3,Status!$T9=\"↑\"),-1,IF(AND(Data!O13<Status!$T$2,Status!$T9=\"↑\"),0,IF(AND(Data!O13>=Status!$T$2,Status!$T9=\"↑\"),1,IF(AND(Data!O13>Status!$T$1,Status!$T9=\"↓\"),-1,IF(AND(Data!O13>=Status!$T$2,Status!$T9=\"↓\"),0,IF(AND(Data!O13<=Status!$T$2,Status!$T9=\"↓\"),1))))))))","v":""},{"$f":"IF($C9=\"\",\"\",IF(Data!P11=\"\",\"\",IF(AND(Data!P13<Status!$T$3,Status!$T9=\"↑\"),-1,IF(AND(Data!P13<Status!$T$2,Status!$T9=\"↑\"),0,IF(AND(Data!P13>=Status!$T$2,Status!$T9=\"↑\"),1,IF(AND(Data!P13>Status!$T$1,Status!$T9=\"↓\"),-1,IF(AND(Data!P13>=Status!$T$2,Status!$T9=\"↓\"),0,IF(AND(Data!P13<=Status!$T$2,Status!$T9=\"↓\"),1))))))))","v":""},{"$f":"IF($C9=\"\",\"\",IF(Data!Q11=\"\",\"\",IF(AND(Data!Q13<Status!$T$3,Status!$T9=\"↑\"),-1,IF(AND(Data!Q13<Status!$T$2,Status!$T9=\"↑\"),0,IF(AND(Data!Q13>=Status!$T$2,Status!$T9=\"↑\"),1,IF(AND(Data!Q13>Status!$T$1,Status!$T9=\"↓\"),-1,IF(AND(Data!Q13>=Status!$T$2,Status!$T9=\"↓\"),0,IF(AND(Data!Q13<=Status!$T$2,Status!$T9=\"↓\"),1))))))))","v":""},{"$f":"IF($C9=\"\",\"\",IF(Data!R11=\"\",\"\",IF(AND(Data!R13<Status!$T$3,Status!$T9=\"↑\"),-1,IF(AND(Data!R13<Status!$T$2,Status!$T9=\"↑\"),0,IF(AND(Data!R13>=Status!$T$2,Status!$T9=\"↑\"),1,IF(AND(Data!R13>Status!$T$1,Status!$T9=\"↓\"),-1,IF(AND(Data!R13>=Status!$T$2,Status!$T9=\"↓\"),0,IF(AND(Data!R13<=Status!$T$2,Status!$T9=\"↓\"),1))))))))","v":""},{"$f":"IF($C9=\"\",\"\",IF(Data!S11=\"\",\"\",IF(AND(Data!S13<Status!$T$3,Status!$T9=\"↑\"),-1,IF(AND(Data!S13<Status!$T$2,Status!$T9=\"↑\"),0,IF(AND(Data!S13>=Status!$T$2,Status!$T9=\"↑\"),1,IF(AND(Data!S13>Status!$T$1,Status!$T9=\"↓\"),-1,IF(AND(Data!S13>=Status!$T$2,Status!$T9=\"↓\"),0,IF(AND(Data!S13<=Status!$T$2,Status!$T9=\"↓\"),1))))))))","v":""},null,{"$f":"IF($C9=\"\",\"\",IF(Data!T11=\"\",\"\",IF(AND(Data!T13<Status!$T$3,Status!$T9=\"↑\"),-1,IF(AND(Data!T13<Status!$T$2,Status!$T9=\"↑\"),0,IF(AND(Data!T13>=Status!$T$2,Status!$T9=\"↑\"),1,IF(AND(Data!T13>Status!$T$1,Status!$T9=\"↓\"),-1,IF(AND(Data!T13>=Status!$T$2,Status!$T9=\"↓\"),0,IF(AND(Data!T13<=Status!$T$2,Status!$T9=\"↓\"),1))))))))","v":1},{"$f":"IF($C9=\"\",\"\",IF(Data!U11=\"\",\"\",IF(AND(Data!U13<Status!$T$3,Status!$T9=\"↑\"),-1,IF(AND(Data!U13<Status!$T$2,Status!$T9=\"↑\"),0,IF(AND(Data!U13>=Status!$T$2,Status!$T9=\"↑\"),1,IF(AND(Data!U13>Status!$T$1,Status!$T9=\"↓\"),-1,IF(AND(Data!U13>=Status!$T$2,Status!$T9=\"↓\"),0,IF(AND(Data!U13<=Status!$T$2,Status!$T9=\"↓\"),1))))))))","v":1},null,{"$f":"Indicators!H8","v":"↓"}]
[]
[null,null,{"$f":"IF(Indicators!D9=\"\",\"\",Indicators!D9)","v":"Número de procesos de capacitación"},{"$f":"IF($C11=\"\",\"\",IF(Data!H14=\"\",\"\",IF(AND(Data!H16<Status!$T$3,Status!$T11=\"↑\"),-1,IF(AND(Data!H16<Status!$T$2,Status!$T11=\"↑\"),0,IF(AND(Data!H16>=Status!$T$2,Status!$T11=\"↑\"),1,IF(AND(Data!H16>Status!$T$1,Status!$T11=\"↓\"),-1,IF(AND(Data!H16>=Status!$T$2,Status!$T11=\"↓\"),0,IF(AND(Data!H16<=Status!$T$2,Status!$T11=\"↓\"),1))))))))","v":1},{"$f":"IF($C11=\"\",\"\",IF(Data!I14=\"\",\"\",IF(AND(Data!I16<Status!$T$3,Status!$T11=\"↑\"),-1,IF(AND(Data!I16<Status!$T$2,Status!$T11=\"↑\"),0,IF(AND(Data!I16>=Status!$T$2,Status!$T11=\"↑\"),1,IF(AND(Data!I16>Status!$T$1,Status!$T11=\"↓\"),-1,IF(AND(Data!I16>=Status!$T$2,Status!$T11=\"↓\"),0,IF(AND(Data!I16<=Status!$T$2,Status!$T11=\"↓\"),1))))))))","v":1},{"$f":"IF($C11=\"\",\"\",IF(Data!J14=\"\",\"\",IF(AND(Data!J16<Status!$T$3,Status!$T11=\"↑\"),-1,IF(AND(Data!J16<Status!$T$2,Status!$T11=\"↑\"),0,IF(AND(Data!J16>=Status!$T$2,Status!$T11=\"↑\"),1,IF(AND(Data!J16>Status!$T$1,Status!$T11=\"↓\"),-1,IF(AND(Data!J16>=Status!$T$2,Status!$T11=\"↓\"),0,IF(AND(Data!J16<=Status!$T$2,Status!$T11=\"↓\"),1))))))))","v":-1},{"$f":"IF($C11=\"\",\"\",IF(Data!K14=\"\",\"\",IF(AND(Data!K16<Status!$T$3,Status!$T11=\"↑\"),-1,IF(AND(Data!K16<Status!$T$2,Status!$T11=\"↑\"),0,IF(AND(Data!K16>=Status!$T$2,Status!$T11=\"↑\"),1,IF(AND(Data!K16>Status!$T$1,Status!$T11=\"↓\"),-1,IF(AND(Data!K16>=Status!$T$2,Status!$T11=\"↓\"),0,IF(AND(Data!K16<=Status!$T$2,Status!$T11=\"↓\"),1))))))))","v":""},{"$f":"IF($C11=\"\",\"\",IF(Data!L14=\"\",\"\",IF(AND(Data!L16<Status!$T$3,Status!$T11=\"↑\"),-1,IF(AND(Data!L16<Status!$T$2,Status!$T11=\"↑\"),0,IF(AND(Data!L16>=Status!$T$2,Status!$T11=\"↑\"),1,IF(AND(Data!L16>Status!$T$1,Status!$T11=\"↓\"),-1,IF(AND(Data!L16>=Status!$T$2,Status!$T11=\"↓\"),0,IF(AND(Data!L16<=Status!$T$2,Status!$T11=\"↓\"),1))))))))","v":""},{"$f":"IF($C11=\"\",\"\",IF(Data!M14=\"\",\"\",IF(AND(Data!M16<Status!$T$3,Status!$T11=\"↑\"),-1,IF(AND(Data!M16<Status!$T$2,Status!$T11=\"↑\"),0,IF(AND(Data!M16>=Status!$T$2,Status!$T11=\"↑\"),1,IF(AND(Data!M16>Status!$T$1,Status!$T11=\"↓\"),-1,IF(AND(Data!M16>=Status!$T$2,Status!$T11=\"↓\"),0,IF(AND(Data!M16<=Status!$T$2,Status!$T11=\"↓\"),1))))))))","v":""},{"$f":"IF($C11=\"\",\"\",IF(Data!N14=\"\",\"\",IF(AND(Data!N16<Status!$T$3,Status!$T11=\"↑\"),-1,IF(AND(Data!N16<Status!$T$2,Status!$T11=\"↑\"),0,IF(AND(Data!N16>=Status!$T$2,Status!$T11=\"↑\"),1,IF(AND(Data!N16>Status!$T$1,Status!$T11=\"↓\"),-1,IF(AND(Data!N16>=Status!$T$2,Status!$T11=\"↓\"),0,IF(AND(Data!N16<=Status!$T$2,Status!$T11=\"↓\"),1))))))))","v":""},{"$f":"IF($C11=\"\",\"\",IF(Data!O14=\"\",\"\",IF(AND(Data!O16<Status!$T$3,Status!$T11=\"↑\"),-1,IF(AND(Data!O16<Status!$T$2,Status!$T11=\"↑\"),0,IF(AND(Data!O16>=Status!$T$2,Status!$T11=\"↑\"),1,IF(AND(Data!O16>Status!$T$1,Status!$T11=\"↓\"),-1,IF(AND(Data!O16>=Status!$T$2,Status!$T11=\"↓\"),0,IF(AND(Data!O16<=Status!$T$2,Status!$T11=\"↓\"),1))))))))","v":""},{"$f":"IF($C11=\"\",\"\",IF(Data!P14=\"\",\"\",IF(AND(Data!P16<Status!$T$3,Status!$T11=\"↑\"),-1,IF(AND(Data!P16<Status!$T$2,Status!$T11=\"↑\"),0,IF(AND(Data!P16>=Status!$T$2,Status!$T11=\"↑\"),1,IF(AND(Data!P16>Status!$T$1,Status!$T11=\"↓\"),-1,IF(AND(Data!P16>=Status!$T$2,Status!$T11=\"↓\"),0,IF(AND(Data!P16<=Status!$T$2,Status!$T11=\"↓\"),1))))))))","v":""},{"$f":"IF($C11=\"\",\"\",IF(Data!Q14=\"\",\"\",IF(AND(Data!Q16<Status!$T$3,Status!$T11=\"↑\"),-1,IF(AND(Data!Q16<Status!$T$2,Status!$T11=\"↑\"),0,IF(AND(Data!Q16>=Status!$T$2,Status!$T11=\"↑\"),1,IF(AND(Data!Q16>Status!$T$1,Status!$T11=\"↓\"),-1,IF(AND(Data!Q16>=Status!$T$2,Status!$T11=\"↓\"),0,IF(AND(Data!Q16<=Status!$T$2,Status!$T11=\"↓\"),1))))))))","v":""},{"$f":"IF($C11=\"\",\"\",IF(Data!R14=\"\",\"\",IF(AND(Data!R16<Status!$T$3,Status!$T11=\"↑\"),-1,IF(AND(Data!R16<Status!$T$2,Status!$T11=\"↑\"),0,IF(AND(Data!R16>=Status!$T$2,Status!$T11=\"↑\"),1,IF(AND(Data!R16>Status!$T$1,Status!$T11=\"↓\"),-1,IF(AND(Data!R16>=Status!$T$2,Status!$T11=\"↓\"),0,IF(AND(Data!R16<=Status!$T$2,Status!$T11=\"↓\"),1))))))))","v":""},{"$f":"IF($C11=\"\",\"\",IF(Data!S14=\"\",\"\",IF(AND(Data!S16<Status!$T$3,Status!$T11=\"↑\"),-1,IF(AND(Data!S16<Status!$T$2,Status!$T11=\"↑\"),0,IF(AND(Data!S16>=Status!$T$2,Status!$T11=\"↑\"),1,IF(AND(Data!S16>Status!$T$1,Status!$T11=\"↓\"),-1,IF(AND(Data!S16>=Status!$T$2,Status!$T11=\"↓\"),0,IF(AND(Data!S16<=Status!$T$2,Status!$T11=\"↓\"),1))))))))","v":""},null,{"$f":"IF($C11=\"\",\"\",IF(Data!T14=\"\",\"\",IF(AND(Data!T16<Status!$T$3,Status!$T11=\"↑\"),-1,IF(AND(Data!T16<Status!$T$2,Status!$T11=\"↑\"),0,IF(AND(Data!T16>=Status!$T$2,Status!$T11=\"↑\"),1,IF(AND(Data!T16>Status!$T$1,Status!$T11=\"↓\"),-1,IF(AND(Data!T16>=Status!$T$2,Status!$T11=\"↓\"),0,IF(AND(Data!T16<=Status!$T$2,Status!$T11=\"↓\"),1))))))))","v":0},{"$f":"IF($C11=\"\",\"\",IF(Data!U14=\"\",\"\",IF(AND(Data!U16<Status!$T$3,Status!$T11=\"↑\"),-1,IF(AND(Data!U16<Status!$T$2,Status!$T11=\"↑\"),0,IF(AND(Data!U16>=Status!$T$2,Status!$T11=\"↑\"),1,IF(AND(Data!U16>Status!$T$1,Status!$T11=\"↓\"),-1,IF(AND(Data!U16>=Status!$T$2,Status!$T11=\"↓\"),0,IF(AND(Data!U16<=Status!$T$2,Status!$T11=\"↓\"),1))))))))","v":0},null,{"$f":"Indicators!H9","v":"↑"}]
[]
[null,null,{"$f":"IF(Indicators!D10=\"\",\"\",Indicators!D10)","v":"Eficiencia del ciclo de producción"},{"$f":"IF($C13=\"\",\"\",IF(Data!H17=\"\",\"\",IF(AND(Data!H19<Status!$T$3,Status!$T13=\"↑\"),-1,IF(AND(Data!H19<Status!$T$2,Status!$T13=\"↑\"),0,IF(AND(Data!H19>=Status!$T$2,Status!$T13=\"↑\"),1,IF(AND(Data!H19>Status!$T$1,Status!$T13=\"↓\"),-1,IF(AND(Data!H19>=Status!$T$2,Status!$T13=\"↓\"),0,IF(AND(Data!H19<=Status!$T$2,Status!$T13=\"↓\"),1))))))))","v":""},{"$f":"IF($C13=\"\",\"\",IF(Data!I17=\"\",\"\",IF(AND(Data!I19<Status!$T$3,Status!$T13=\"↑\"),-1,IF(AND(Data!I19<Status!$T$2,Status!$T13=\"↑\"),0,IF(AND(Data!I19>=Status!$T$2,Status!$T13=\"↑\"),1,IF(AND(Data!I19>Status!$T$1,Status!$T13=\"↓\"),-1,IF(AND(Data!I19>=Status!$T$2,Status!$T13=\"↓\"),0,IF(AND(Data!I19<=Status!$T$2,Status!$T13=\"↓\"),1))))))))","v":""},{"$f":"IF($C13=\"\",\"\",IF(Data!J17=\"\",\"\",IF(AND(Data!J19<Status!$T$3,Status!$T13=\"↑\"),-1,IF(AND(Data!J19<Status!$T$2,Status!$T13=\"↑\"),0,IF(AND(Data!J19>=Status!$T$2,Status!$T13=\"↑\"),1,IF(AND(Data!J19>Status!$T$1,Status!$T13=\"↓\"),-1,IF(AND(Data!J19>=Status!$T$2,Status!$T13=\"↓\"),0,IF(AND(Data!J19<=Status!$T$2,Status!$T13=\"↓\"),1))))))))","v":""},{"$f":"IF($C13=\"\",\"\",IF(Data!K17=\"\",\"\",IF(AND(Data!K19<Status!$T$3,Status!$T13=\"↑\"),-1,IF(AND(Data!K19<Status!$T$2,Status!$T13=\"↑\"),0,IF(AND(Data!K19>=Status!$T$2,Status!$T13=\"↑\"),1,IF(AND(Data!K19>Status!$T$1,Status!$T13=\"↓\"),-1,IF(AND(Data!K19>=Status!$T$2,Status!$T13=\"↓\"),0,IF(AND(Data!K19<=Status!$T$2,Status!$T13=\"↓\"),1))))))))","v":""},{"$f":"IF($C13=\"\",\"\",IF(Data!L17=\"\",\"\",IF(AND(Data!L19<Status!$T$3,Status!$T13=\"↑\"),-1,IF(AND(Data!L19<Status!$T$2,Status!$T13=\"↑\"),0,IF(AND(Data!L19>=Status!$T$2,Status!$T13=\"↑\"),1,IF(AND(Data!L19>Status!$T$1,Status!$T13=\"↓\"),-1,IF(AND(Data!L19>=Status!$T$2,Status!$T13=\"↓\"),0,IF(AND(Data!L19<=Status!$T$2,Status!$T13=\"↓\"),1))))))))","v":""},{"$f":"IF($C13=\"\",\"\",IF(Data!M17=\"\",\"\",IF(AND(Data!M19<Status!$T$3,Status!$T13=\"↑\"),-1,IF(AND(Data!M19<Status!$T$2,Status!$T13=\"↑\"),0,IF(AND(Data!M19>=Status!$T$2,Status!$T13=\"↑\"),1,IF(AND(Data!M19>Status!$T$1,Status!$T13=\"↓\"),-1,IF(AND(Data!M19>=Status!$T$2,Status!$T13=\"↓\"),0,IF(AND(Data!M19<=Status!$T$2,Status!$T13=\"↓\"),1))))))))","v":""},{"$f":"IF($C13=\"\",\"\",IF(Data!N17=\"\",\"\",IF(AND(Data!N19<Status!$T$3,Status!$T13=\"↑\"),-1,IF(AND(Data!N19<Status!$T$2,Status!$T13=\"↑\"),0,IF(AND(Data!N19>=Status!$T$2,Status!$T13=\"↑\"),1,IF(AND(Data!N19>Status!$T$1,Status!$T13=\"↓\"),-1,IF(AND(Data!N19>=Status!$T$2,Status!$T13=\"↓\"),0,IF(AND(Data!N19<=Status!$T$2,Status!$T13=\"↓\"),1))))))))","v":""},{"$f":"IF($C13=\"\",\"\",IF(Data!O17=\"\",\"\",IF(AND(Data!O19<Status!$T$3,Status!$T13=\"↑\"),-1,IF(AND(Data!O19<Status!$T$2,Status!$T13=\"↑\"),0,IF(AND(Data!O19>=Status!$T$2,Status!$T13=\"↑\"),1,IF(AND(Data!O19>Status!$T$1,Status!$T13=\"↓\"),-1,IF(AND(Data!O19>=Status!$T$2,Status!$T13=\"↓\"),0,IF(AND(Data!O19<=Status!$T$2,Status!$T13=\"↓\"),1))))))))","v":""},{"$f":"IF($C13=\"\",\"\",IF(Data!P17=\"\",\"\",IF(AND(Data!P19<Status!$T$3,Status!$T13=\"↑\"),-1,IF(AND(Data!P19<Status!$T$2,Status!$T13=\"↑\"),0,IF(AND(Data!P19>=Status!$T$2,Status!$T13=\"↑\"),1,IF(AND(Data!P19>Status!$T$1,Status!$T13=\"↓\"),-1,IF(AND(Data!P19>=Status!$T$2,Status!$T13=\"↓\"),0,IF(AND(Data!P19<=Status!$T$2,Status!$T13=\"↓\"),1))))))))","v":""},{"$f":"IF($C13=\"\",\"\",IF(Data!Q17=\"\",\"\",IF(AND(Data!Q19<Status!$T$3,Status!$T13=\"↑\"),-1,IF(AND(Data!Q19<Status!$T$2,Status!$T13=\"↑\"),0,IF(AND(Data!Q19>=Status!$T$2,Status!$T13=\"↑\"),1,IF(AND(Data!Q19>Status!$T$1,Status!$T13=\"↓\"),-1,IF(AND(Data!Q19>=Status!$T$2,Status!$T13=\"↓\"),0,IF(AND(Data!Q19<=Status!$T$2,Status!$T13=\"↓\"),1))))))))","v":""},{"$f":"IF($C13=\"\",\"\",IF(Data!R17=\"\",\"\",IF(AND(Data!R19<Status!$T$3,Status!$T13=\"↑\"),-1,IF(AND(Data!R19<Status!$T$2,Status!$T13=\"↑\"),0,IF(AND(Data!R19>=Status!$T$2,Status!$T13=\"↑\"),1,IF(AND(Data!R19>Status!$T$1,Status!$T13=\"↓\"),-1,IF(AND(Data!R19>=Status!$T$2,Status!$T13=\"↓\"),0,IF(AND(Data!R19<=Status!$T$2,Status!$T13=\"↓\"),1))))))))","v":""},{"$f":"IF($C13=\"\",\"\",IF(Data!S17=\"\",\"\",IF(AND(Data!S19<Status!$T$3,Status!$T13=\"↑\"),-1,IF(AND(Data!S19<Status!$T$2,Status!$T13=\"↑\"),0,IF(AND(Data!S19>=Status!$T$2,Status!$T13=\"↑\"),1,IF(AND(Data!S19>Status!$T$1,Status!$T13=\"↓\"),-1,IF(AND(Data!S19>=Status!$T$2,Status!$T13=\"↓\"),0,IF(AND(Data!S19<=Status!$T$2,Status!$T13=\"↓\"),1))))))))","v":""},null,{"$f":"IF($C13=\"\",\"\",IF(Data!T17=\"\",\"\",IF(AND(Data!T19<Status!$T$3,Status!$T13=\"↑\"),-1,IF(AND(Data!T19<Status!$T$2,Status!$T13=\"↑\"),0,IF(AND(Data!T19>=Status!$T$2,Status!$T13=\"↑\"),1,IF(AND(Data!T19>Status!$T$1,Status!$T13=\"↓\"),-1,IF(AND(Data!T19>=Status!$T$2,Status!$T13=\"↓\"),0,IF(AND(Data!T19<=Status!$T$2,Status!$T13=\"↓\"),1))))))))","v":-1},{"$f":"IF($C13=\"\",\"\",IF(Data!U17=\"\",\"\",IF(AND(Data!U19<Status!$T$3,Status!$T13=\"↑\"),-1,IF(AND(Data!U19<Status!$T$2,Status!$T13=\"↑\"),0,IF(AND(Data!U19>=Status!$T$2,Status!$T13=\"↑\"),1,IF(AND(Data!U19>Status!$T$1,Status!$T13=\"↓\"),-1,IF(AND(Data!U19>=Status!$T$2,Status!$T13=\"↓\"),0,IF(AND(Data!U19<=Status!$T$2,Status!$T13=\"↓\"),1))))))))","v":-1},null,{"$f":"Indicators!H10","v":"↑"}]
[]
[null,null,{"$f":"IF(Indicators!D11=\"\",\"\",Indicators!D11)","v":"Tiempo de inactividad no planificada por TI"},{"$f":"IF($C15=\"\",\"\",IF(Data!H20=\"\",\"\",IF(AND(Data!H22<Status!$T$3,Status!$T15=\"↑\"),-1,IF(AND(Data!H22<Status!$T$2,Status!$T15=\"↑\"),0,IF(AND(Data!H22>=Status!$T$2,Status!$T15=\"↑\"),1,IF(AND(Data!H22>Status!$T$1,Status!$T15=\"↓\"),-1,IF(AND(Data!H22>=Status!$T$2,Status!$T15=\"↓\"),0,IF(AND(Data!H22<=Status!$T$2,Status!$T15=\"↓\"),1))))))))","v":""},{"$f":"IF($C15=\"\",\"\",IF(Data!I20=\"\",\"\",IF(AND(Data!I22<Status!$T$3,Status!$T15=\"↑\"),-1,IF(AND(Data!I22<Status!$T$2,Status!$T15=\"↑\"),0,IF(AND(Data!I22>=Status!$T$2,Status!$T15=\"↑\"),1,IF(AND(Data!I22>Status!$T$1,Status!$T15=\"↓\"),-1,IF(AND(Data!I22>=Status!$T$2,Status!$T15=\"↓\"),0,IF(AND(Data!I22<=Status!$T$2,Status!$T15=\"↓\"),1))))))))","v":""},{"$f":"IF($C15=\"\",\"\",IF(Data!J20=\"\",\"\",IF(AND(Data!J22<Status!$T$3,Status!$T15=\"↑\"),-1,IF(AND(Data!J22<Status!$T$2,Status!$T15=\"↑\"),0,IF(AND(Data!J22>=Status!$T$2,Status!$T15=\"↑\"),1,IF(AND(Data!J22>Status!$T$1,Status!$T15=\"↓\"),-1,IF(AND(Data!J22>=Status!$T$2,Status!$T15=\"↓\"),0,IF(AND(Data!J22<=Status!$T$2,Status!$T15=\"↓\"),1))))))))","v":""},{"$f":"IF($C15=\"\",\"\",IF(Data!K20=\"\",\"\",IF(AND(Data!K22<Status!$T$3,Status!$T15=\"↑\"),-1,IF(AND(Data!K22<Status!$T$2,Status!$T15=\"↑\"),0,IF(AND(Data!K22>=Status!$T$2,Status!$T15=\"↑\"),1,IF(AND(Data!K22>Status!$T$1,Status!$T15=\"↓\"),-1,IF(AND(Data!K22>=Status!$T$2,Status!$T15=\"↓\"),0,IF(AND(Data!K22<=Status!$T$2,Status!$T15=\"↓\"),1))))))))","v":""},{"$f":"IF($C15=\"\",\"\",IF(Data!L20=\"\",\"\",IF(AND(Data!L22<Status!$T$3,Status!$T15=\"↑\"),-1,IF(AND(Data!L22<Status!$T$2,Status!$T15=\"↑\"),0,IF(AND(Data!L22>=Status!$T$2,Status!$T15=\"↑\"),1,IF(AND(Data!L22>Status!$T$1,Status!$T15=\"↓\"),-1,IF(AND(Data!L22>=Status!$T$2,Status!$T15=\"↓\"),0,IF(AND(Data!L22<=Status!$T$2,Status!$T15=\"↓\"),1))))))))","v":""},{"$f":"IF($C15=\"\",\"\",IF(Data!M20=\"\",\"\",IF(AND(Data!M22<Status!$T$3,Status!$T15=\"↑\"),-1,IF(AND(Data!M22<Status!$T$2,Status!$T15=\"↑\"),0,IF(AND(Data!M22>=Status!$T$2,Status!$T15=\"↑\"),1,IF(AND(Data!M22>Status!$T$1,Status!$T15=\"↓\"),-1,IF(AND(Data!M22>=Status!$T$2,Status!$T15=\"↓\"),0,IF(AND(Data!M22<=Status!$T$2,Status!$T15=\"↓\"),1))))))))","v":""},{"$f":"IF($C15=\"\",\"\",IF(Data!N20=\"\",\"\",IF(AND(Data!N22<Status!$T$3,Status!$T15=\"↑\"),-1,IF(AND(Data!N22<Status!$T$2,Status!$T15=\"↑\"),0,IF(AND(Data!N22>=Status!$T$2,Status!$T15=\"↑\"),1,IF(AND(Data!N22>Status!$T$1,Status!$T15=\"↓\"),-1,IF(AND(Data!N22>=Status!$T$2,Status!$T15=\"↓\"),0,IF(AND(Data!N22<=Status!$T$2,Status!$T15=\"↓\"),1))))))))","v":""},{"$f":"IF($C15=\"\",\"\",IF(Data!O20=\"\",\"\",IF(AND(Data!O22<Status!$T$3,Status!$T15=\"↑\"),-1,IF(AND(Data!O22<Status!$T$2,Status!$T15=\"↑\"),0,IF(AND(Data!O22>=Status!$T$2,Status!$T15=\"↑\"),1,IF(AND(Data!O22>Status!$T$1,Status!$T15=\"↓\"),-1,IF(AND(Data!O22>=Status!$T$2,Status!$T15=\"↓\"),0,IF(AND(Data!O22<=Status!$T$2,Status!$T15=\"↓\"),1))))))))","v":""},{"$f":"IF($C15=\"\",\"\",IF(Data!P20=\"\",\"\",IF(AND(Data!P22<Status!$T$3,Status!$T15=\"↑\"),-1,IF(AND(Data!P22<Status!$T$2,Status!$T15=\"↑\"),0,IF(AND(Data!P22>=Status!$T$2,Status!$T15=\"↑\"),1,IF(AND(Data!P22>Status!$T$1,Status!$T15=\"↓\"),-1,IF(AND(Data!P22>=Status!$T$2,Status!$T15=\"↓\"),0,IF(AND(Data!P22<=Status!$T$2,Status!$T15=\"↓\"),1))))))))","v":""},{"$f":"IF($C15=\"\",\"\",IF(Data!Q20=\"\",\"\",IF(AND(Data!Q22<Status!$T$3,Status!$T15=\"↑\"),-1,IF(AND(Data!Q22<Status!$T$2,Status!$T15=\"↑\"),0,IF(AND(Data!Q22>=Status!$T$2,Status!$T15=\"↑\"),1,IF(AND(Data!Q22>Status!$T$1,Status!$T15=\"↓\"),-1,IF(AND(Data!Q22>=Status!$T$2,Status!$T15=\"↓\"),0,IF(AND(Data!Q22<=Status!$T$2,Status!$T15=\"↓\"),1))))))))","v":""},{"$f":"IF($C15=\"\",\"\",IF(Data!R20=\"\",\"\",IF(AND(Data!R22<Status!$T$3,Status!$T15=\"↑\"),-1,IF(AND(Data!R22<Status!$T$2,Status!$T15=\"↑\"),0,IF(AND(Data!R22>=Status!$T$2,Status!$T15=\"↑\"),1,IF(AND(Data!R22>Status!$T$1,Status!$T15=\"↓\"),-1,IF(AND(Data!R22>=Status!$T$2,Status!$T15=\"↓\"),0,IF(AND(Data!R22<=Status!$T$2,Status!$T15=\"↓\"),1))))))))","v":""},{"$f":"IF($C15=\"\",\"\",IF(Data!S20=\"\",\"\",IF(AND(Data!S22<Status!$T$3,Status!$T15=\"↑\"),-1,IF(AND(Data!S22<Status!$T$2,Status!$T15=\"↑\"),0,IF(AND(Data!S22>=Status!$T$2,Status!$T15=\"↑\"),1,IF(AND(Data!S22>Status!$T$1,Status!$T15=\"↓\"),-1,IF(AND(Data!S22>=Status!$T$2,Status!$T15=\"↓\"),0,IF(AND(Data!S22<=Status!$T$2,Status!$T15=\"↓\"),1))))))))","v":""},null,{"$f":"IF($C15=\"\",\"\",IF(Data!T20=\"\",\"\",IF(AND(Data!T22<Status!$T$3,Status!$T15=\"↑\"),-1,IF(AND(Data!T22<Status!$T$2,Status!$T15=\"↑\"),0,IF(AND(Data!T22>=Status!$T$2,Status!$T15=\"↑\"),1,IF(AND(Data!T22>Status!$T$1,Status!$T15=\"↓\"),-1,IF(AND(Data!T22>=Status!$T$2,Status!$T15=\"↓\"),0,IF(AND(Data!T22<=Status!$T$2,Status!$T15=\"↓\"),1))))))))","v":1},{"$f":"IF($C15=\"\",\"\",IF(Data!U20=\"\",\"\",IF(AND(Data!U22<Status!$T$3,Status!$T15=\"↑\"),-1,IF(AND(Data!U22<Status!$T$2,Status!$T15=\"↑\"),0,IF(AND(Data!U22>=Status!$T$2,Status!$T15=\"↑\"),1,IF(AND(Data!U22>Status!$T$1,Status!$T15=\"↓\"),-1,IF(AND(Data!U22>=Status!$T$2,Status!$T15=\"↓\"),0,IF(AND(Data!U22<=Status!$T$2,Status!$T15=\"↓\"),1))))))))","v":1},null,{"$f":"Indicators!H11","v":"↓"}]
[]
[null,null,{"$f":"IF(Indicators!D12=\"\",\"\",Indicators!D12)","v":"Tasa de mantenimientos preventivos a los equipos"},{"$f":"IF($C17=\"\",\"\",IF(Data!H23=\"\",\"\",IF(AND(Data!H25<Status!$T$3,Status!$T17=\"↑\"),-1,IF(AND(Data!H25<Status!$T$2,Status!$T17=\"↑\"),0,IF(AND(Data!H25>=Status!$T$2,Status!$T17=\"↑\"),1,IF(AND(Data!H25>Status!$T$1,Status!$T17=\"↓\"),-1,IF(AND(Data!H25>=Status!$T$2,Status!$T17=\"↓\"),0,IF(AND(Data!H25<=Status!$T$2,Status!$T17=\"↓\"),1))))))))","v":""},{"$f":"IF($C17=\"\",\"\",IF(Data!I23=\"\",\"\",IF(AND(Data!I25<Status!$T$3,Status!$T17=\"↑\"),-1,IF(AND(Data!I25<Status!$T$2,Status!$T17=\"↑\"),0,IF(AND(Data!I25>=Status!$T$2,Status!$T17=\"↑\"),1,IF(AND(Data!I25>Status!$T$1,Status!$T17=\"↓\"),-1,IF(AND(Data!I25>=Status!$T$2,Status!$T17=\"↓\"),0,IF(AND(Data!I25<=Status!$T$2,Status!$T17=\"↓\"),1))))))))","v":""},{"$f":"IF($C17=\"\",\"\",IF(Data!J23=\"\",\"\",IF(AND(Data!J25<Status!$T$3,Status!$T17=\"↑\"),-1,IF(AND(Data!J25<Status!$T$2,Status!$T17=\"↑\"),0,IF(AND(Data!J25>=Status!$T$2,Status!$T17=\"↑\"),1,IF(AND(Data!J25>Status!$T$1,Status!$T17=\"↓\"),-1,IF(AND(Data!J25>=Status!$T$2,Status!$T17=\"↓\"),0,IF(AND(Data!J25<=Status!$T$2,Status!$T17=\"↓\"),1))))))))","v":""},{"$f":"IF($C17=\"\",\"\",IF(Data!K23=\"\",\"\",IF(AND(Data!K25<Status!$T$3,Status!$T17=\"↑\"),-1,IF(AND(Data!K25<Status!$T$2,Status!$T17=\"↑\"),0,IF(AND(Data!K25>=Status!$T$2,Status!$T17=\"↑\"),1,IF(AND(Data!K25>Status!$T$1,Status!$T17=\"↓\"),-1,IF(AND(Data!K25>=Status!$T$2,Status!$T17=\"↓\"),0,IF(AND(Data!K25<=Status!$T$2,Status!$T17=\"↓\"),1))))))))","v":""},{"$f":"IF($C17=\"\",\"\",IF(Data!L23=\"\",\"\",IF(AND(Data!L25<Status!$T$3,Status!$T17=\"↑\"),-1,IF(AND(Data!L25<Status!$T$2,Status!$T17=\"↑\"),0,IF(AND(Data!L25>=Status!$T$2,Status!$T17=\"↑\"),1,IF(AND(Data!L25>Status!$T$1,Status!$T17=\"↓\"),-1,IF(AND(Data!L25>=Status!$T$2,Status!$T17=\"↓\"),0,IF(AND(Data!L25<=Status!$T$2,Status!$T17=\"↓\"),1))))))))","v":""},{"$f":"IF($C17=\"\",\"\",IF(Data!M23=\"\",\"\",IF(AND(Data!M25<Status!$T$3,Status!$T17=\"↑\"),-1,IF(AND(Data!M25<Status!$T$2,Status!$T17=\"↑\"),0,IF(AND(Data!M25>=Status!$T$2,Status!$T17=\"↑\"),1,IF(AND(Data!M25>Status!$T$1,Status!$T17=\"↓\"),-1,IF(AND(Data!M25>=Status!$T$2,Status!$T17=\"↓\"),0,IF(AND(Data!M25<=Status!$T$2,Status!$T17=\"↓\"),1))))))))","v":""},{"$f":"IF($C17=\"\",\"\",IF(Data!N23=\"\",\"\",IF(AND(Data!N25<Status!$T$3,Status!$T17=\"↑\"),-1,IF(AND(Data!N25<Status!$T$2,Status!$T17=\"↑\"),0,IF(AND(Data!N25>=Status!$T$2,Status!$T17=\"↑\"),1,IF(AND(Data!N25>Status!$T$1,Status!$T17=\"↓\"),-1,IF(AND(Data!N25>=Status!$T$2,Status!$T17=\"↓\"),0,IF(AND(Data!N25<=Status!$T$2,Status!$T17=\"↓\"),1))))))))","v":""},{"$f":"IF($C17=\"\",\"\",IF(Data!O23=\"\",\"\",IF(AND(Data!O25<Status!$T$3,Status!$T17=\"↑\"),-1,IF(AND(Data!O25<Status!$T$2,Status!$T17=\"↑\"),0,IF(AND(Data!O25>=Status!$T$2,Status!$T17=\"↑\"),1,IF(AND(Data!O25>Status!$T$1,Status!$T17=\"↓\"),-1,IF(AND(Data!O25>=Status!$T$2,Status!$T17=\"↓\"),0,IF(AND(Data!O25<=Status!$T$2,Status!$T17=\"↓\"),1))))))))","v":""},{"$f":"IF($C17=\"\",\"\",IF(Data!P23=\"\",\"\",IF(AND(Data!P25<Status!$T$3,Status!$T17=\"↑\"),-1,IF(AND(Data!P25<Status!$T$2,Status!$T17=\"↑\"),0,IF(AND(Data!P25>=Status!$T$2,Status!$T17=\"↑\"),1,IF(AND(Data!P25>Status!$T$1,Status!$T17=\"↓\"),-1,IF(AND(Data!P25>=Status!$T$2,Status!$T17=\"↓\"),0,IF(AND(Data!P25<=Status!$T$2,Status!$T17=\"↓\"),1))))))))","v":""},{"$f":"IF($C17=\"\",\"\",IF(Data!Q23=\"\",\"\",IF(AND(Data!Q25<Status!$T$3,Status!$T17=\"↑\"),-1,IF(AND(Data!Q25<Status!$T$2,Status!$T17=\"↑\"),0,IF(AND(Data!Q25>=Status!$T$2,Status!$T17=\"↑\"),1,IF(AND(Data!Q25>Status!$T$1,Status!$T17=\"↓\"),-1,IF(AND(Data!Q25>=Status!$T$2,Status!$T17=\"↓\"),0,IF(AND(Data!Q25<=Status!$T$2,Status!$T17=\"↓\"),1))))))))","v":""},{"$f":"IF($C17=\"\",\"\",IF(Data!R23=\"\",\"\",IF(AND(Data!R25<Status!$T$3,Status!$T17=\"↑\"),-1,IF(AND(Data!R25<Status!$T$2,Status!$T17=\"↑\"),0,IF(AND(Data!R25>=Status!$T$2,Status!$T17=\"↑\"),1,IF(AND(Data!R25>Status!$T$1,Status!$T17=\"↓\"),-1,IF(AND(Data!R25>=Status!$T$2,Status!$T17=\"↓\"),0,IF(AND(Data!R25<=Status!$T$2,Status!$T17=\"↓\"),1))))))))","v":""},{"$f":"IF($C17=\"\",\"\",IF(Data!S23=\"\",\"\",IF(AND(Data!S25<Status!$T$3,Status!$T17=\"↑\"),-1,IF(AND(Data!S25<Status!$T$2,Status!$T17=\"↑\"),0,IF(AND(Data!S25>=Status!$T$2,Status!$T17=\"↑\"),1,IF(AND(Data!S25>Status!$T$1,Status!$T17=\"↓\"),-1,IF(AND(Data!S25>=Status!$T$2,Status!$T17=\"↓\"),0,IF(AND(Data!S25<=Status!$T$2,Status!$T17=\"↓\"),1))))))))","v":""},null,{"$f":"IF($C17=\"\",\"\",IF(Data!T23=\"\",\"\",IF(AND(Data!T25<Status!$T$3,Status!$T17=\"↑\"),-1,IF(AND(Data!T25<Status!$T$2,Status!$T17=\"↑\"),0,IF(AND(Data!T25>=Status!$T$2,Status!$T17=\"↑\"),1,IF(AND(Data!T25>Status!$T$1,Status!$T17=\"↓\"),-1,IF(AND(Data!T25>=Status!$T$2,Status!$T17=\"↓\"),0,IF(AND(Data!T25<=Status!$T$2,Status!$T17=\"↓\"),1))))))))","v":-1},{"$f":"IF($C17=\"\",\"\",IF(Data!U23=\"\",\"\",IF(AND(Data!U25<Status!$T$3,Status!$T17=\"↑\"),-1,IF(AND(Data!U25<Status!$T$2,Status!$T17=\"↑\"),0,IF(AND(Data!U25>=Status!$T$2,Status!$T17=\"↑\"),1,IF(AND(Data!U25>Status!$T$1,Status!$T17=\"↓\"),-1,IF(AND(Data!U25>=Status!$T$2,Status!$T17=\"↓\"),0,IF(AND(Data!U25<=Status!$T$2,Status!$T17=\"↓\"),1))))))))","v":-1},null,{"$f":"Indicators!H12","v":"↑"}]
[]
[null,null,{"$f":"IF(Indicators!D13=\"\",\"\",Indicators!D13)","v":"Número de seguidores de FB"},{"$f":"IF($C19=\"\",\"\",IF(Data!H26=\"\",\"\",IF(AND(Data!H28<Status!$T$3,Status!$T19=\"↑\"),-1,IF(AND(Data!H28<Status!$T$2,Status!$T19=\"↑\"),0,IF(AND(Data!H28>=Status!$T$2,Status!$T19=\"↑\"),1,IF(AND(Data!H28>Status!$T$1,Status!$T19=\"↓\"),-1,IF(AND(Data!H28>=Status!$T$2,Status!$T19=\"↓\"),0,IF(AND(Data!H28<=Status!$T$2,Status!$T19=\"↓\"),1))))))))","v":0},{"$f":"IF($C19=\"\",\"\",IF(Data!I26=\"\",\"\",IF(AND(Data!I28<Status!$T$3,Status!$T19=\"↑\"),-1,IF(AND(Data!I28<Status!$T$2,Status!$T19=\"↑\"),0,IF(AND(Data!I28>=Status!$T$2,Status!$T19=\"↑\"),1,IF(AND(Data!I28>Status!$T$1,Status!$T19=\"↓\"),-1,IF(AND(Data!I28>=Status!$T$2,Status!$T19=\"↓\"),0,IF(AND(Data!I28<=Status!$T$2,Status!$T19=\"↓\"),1))))))))","v":0},{"$f":"IF($C19=\"\",\"\",IF(Data!J26=\"\",\"\",IF(AND(Data!J28<Status!$T$3,Status!$T19=\"↑\"),-1,IF(AND(Data!J28<Status!$T$2,Status!$T19=\"↑\"),0,IF(AND(Data!J28>=Status!$T$2,Status!$T19=\"↑\"),1,IF(AND(Data!J28>Status!$T$1,Status!$T19=\"↓\"),-1,IF(AND(Data!J28>=Status!$T$2,Status!$T19=\"↓\"),0,IF(AND(Data!J28<=Status!$T$2,Status!$T19=\"↓\"),1))))))))","v":""},{"$f":"IF($C19=\"\",\"\",IF(Data!K26=\"\",\"\",IF(AND(Data!K28<Status!$T$3,Status!$T19=\"↑\"),-1,IF(AND(Data!K28<Status!$T$2,Status!$T19=\"↑\"),0,IF(AND(Data!K28>=Status!$T$2,Status!$T19=\"↑\"),1,IF(AND(Data!K28>Status!$T$1,Status!$T19=\"↓\"),-1,IF(AND(Data!K28>=Status!$T$2,Status!$T19=\"↓\"),0,IF(AND(Data!K28<=Status!$T$2,Status!$T19=\"↓\"),1))))))))","v":""},{"$f":"IF($C19=\"\",\"\",IF(Data!L26=\"\",\"\",IF(AND(Data!L28<Status!$T$3,Status!$T19=\"↑\"),-1,IF(AND(Data!L28<Status!$T$2,Status!$T19=\"↑\"),0,IF(AND(Data!L28>=Status!$T$2,Status!$T19=\"↑\"),1,IF(AND(Data!L28>Status!$T$1,Status!$T19=\"↓\"),-1,IF(AND(Data!L28>=Status!$T$2,Status!$T19=\"↓\"),0,IF(AND(Data!L28<=Status!$T$2,Status!$T19=\"↓\"),1))))))))","v":""},{"$f":"IF($C19=\"\",\"\",IF(Data!M26=\"\",\"\",IF(AND(Data!M28<Status!$T$3,Status!$T19=\"↑\"),-1,IF(AND(Data!M28<Status!$T$2,Status!$T19=\"↑\"),0,IF(AND(Data!M28>=Status!$T$2,Status!$T19=\"↑\"),1,IF(AND(Data!M28>Status!$T$1,Status!$T19=\"↓\"),-1,IF(AND(Data!M28>=Status!$T$2,Status!$T19=\"↓\"),0,IF(AND(Data!M28<=Status!$T$2,Status!$T19=\"↓\"),1))))))))","v":""},{"$f":"IF($C19=\"\",\"\",IF(Data!N26=\"\",\"\",IF(AND(Data!N28<Status!$T$3,Status!$T19=\"↑\"),-1,IF(AND(Data!N28<Status!$T$2,Status!$T19=\"↑\"),0,IF(AND(Data!N28>=Status!$T$2,Status!$T19=\"↑\"),1,IF(AND(Data!N28>Status!$T$1,Status!$T19=\"↓\"),-1,IF(AND(Data!N28>=Status!$T$2,Status!$T19=\"↓\"),0,IF(AND(Data!N28<=Status!$T$2,Status!$T19=\"↓\"),1))))))))","v":""},{"$f":"IF($C19=\"\",\"\",IF(Data!O26=\"\",\"\",IF(AND(Data!O28<Status!$T$3,Status!$T19=\"↑\"),-1,IF(AND(Data!O28<Status!$T$2,Status!$T19=\"↑\"),0,IF(AND(Data!O28>=Status!$T$2,Status!$T19=\"↑\"),1,IF(AND(Data!O28>Status!$T$1,Status!$T19=\"↓\"),-1,IF(AND(Data!O28>=Status!$T$2,Status!$T19=\"↓\"),0,IF(AND(Data!O28<=Status!$T$2,Status!$T19=\"↓\"),1))))))))","v":""},{"$f":"IF($C19=\"\",\"\",IF(Data!P26=\"\",\"\",IF(AND(Data!P28<Status!$T$3,Status!$T19=\"↑\"),-1,IF(AND(Data!P28<Status!$T$2,Status!$T19=\"↑\"),0,IF(AND(Data!P28>=Status!$T$2,Status!$T19=\"↑\"),1,IF(AND(Data!P28>Status!$T$1,Status!$T19=\"↓\"),-1,IF(AND(Data!P28>=Status!$T$2,Status!$T19=\"↓\"),0,IF(AND(Data!P28<=Status!$T$2,Status!$T19=\"↓\"),1))))))))","v":""},{"$f":"IF($C19=\"\",\"\",IF(Data!Q26=\"\",\"\",IF(AND(Data!Q28<Status!$T$3,Status!$T19=\"↑\"),-1,IF(AND(Data!Q28<Status!$T$2,Status!$T19=\"↑\"),0,IF(AND(Data!Q28>=Status!$T$2,Status!$T19=\"↑\"),1,IF(AND(Data!Q28>Status!$T$1,Status!$T19=\"↓\"),-1,IF(AND(Data!Q28>=Status!$T$2,Status!$T19=\"↓\"),0,IF(AND(Data!Q28<=Status!$T$2,Status!$T19=\"↓\"),1))))))))","v":""},{"$f":"IF($C19=\"\",\"\",IF(Data!R26=\"\",\"\",IF(AND(Data!R28<Status!$T$3,Status!$T19=\"↑\"),-1,IF(AND(Data!R28<Status!$T$2,Status!$T19=\"↑\"),0,IF(AND(Data!R28>=Status!$T$2,Status!$T19=\"↑\"),1,IF(AND(Data!R28>Status!$T$1,Status!$T19=\"↓\"),-1,IF(AND(Data!R28>=Status!$T$2,Status!$T19=\"↓\"),0,IF(AND(Data!R28<=Status!$T$2,Status!$T19=\"↓\"),1))))))))","v":""},{"$f":"IF($C19=\"\",\"\",IF(Data!S26=\"\",\"\",IF(AND(Data!S28<Status!$T$3,Status!$T19=\"↑\"),-1,IF(AND(Data!S28<Status!$T$2,Status!$T19=\"↑\"),0,IF(AND(Data!S28>=Status!$T$2,Status!$T19=\"↑\"),1,IF(AND(Data!S28>Status!$T$1,Status!$T19=\"↓\"),-1,IF(AND(Data!S28>=Status!$T$2,Status!$T19=\"↓\"),0,IF(AND(Data!S28<=Status!$T$2,Status!$T19=\"↓\"),1))))))))","v":""},null,{"$f":"IF($C19=\"\",\"\",IF(Data!T26=\"\",\"\",IF(AND(Data!T28<Status!$T$3,Status!$T19=\"↑\"),-1,IF(AND(Data!T28<Status!$T$2,Status!$T19=\"↑\"),0,IF(AND(Data!T28>=Status!$T$2,Status!$T19=\"↑\"),1,IF(AND(Data!T28>Status!$T$1,Status!$T19=\"↓\"),-1,IF(AND(Data!T28>=Status!$T$2,Status!$T19=\"↓\"),0,IF(AND(Data!T28<=Status!$T$2,Status!$T19=\"↓\"),1))))))))","v":0},{"$f":"IF($C19=\"\",\"\",IF(Data!U26=\"\",\"\",IF(AND(Data!U28<Status!$T$3,Status!$T19=\"↑\"),-1,IF(AND(Data!U28<Status!$T$2,Status!$T19=\"↑\"),0,IF(AND(Data!U28>=Status!$T$2,Status!$T19=\"↑\"),1,IF(AND(Data!U28>Status!$T$1,Status!$T19=\"↓\"),-1,IF(AND(Data!U28>=Status!$T$2,Status!$T19=\"↓\"),0,IF(AND(Data!U28<=Status!$T$2,Status!$T19=\"↓\"),1))))))))","v":0},null,{"$f":"Indicators!H13","v":"↑"}]
[]
[null,null,{"$f":"IF(Indicators!D14=\"\",\"\",Indicators!D14)","v":"Tasa de conversión de leads a clientes"},{"$f":"IF($C21=\"\",\"\",IF(Data!H29=\"\",\"\",IF(AND(Data!H31<Status!$T$3,Status!$T21=\"↑\"),-1,IF(AND(Data!H31<Status!$T$2,Status!$T21=\"↑\"),0,IF(AND(Data!H31>=Status!$T$2,Status!$T21=\"↑\"),1,IF(AND(Data!H31>Status!$T$1,Status!$T21=\"↓\"),-1,IF(AND(Data!H31>=Status!$T$2,Status!$T21=\"↓\"),0,IF(AND(Data!H31<=Status!$T$2,Status!$T21=\"↓\"),1))))))))","v":""},{"$f":"IF($C21=\"\",\"\",IF(Data!I29=\"\",\"\",IF(AND(Data!I31<Status!$T$3,Status!$T21=\"↑\"),-1,IF(AND(Data!I31<Status!$T$2,Status!$T21=\"↑\"),0,IF(AND(Data!I31>=Status!$T$2,Status!$T21=\"↑\"),1,IF(AND(Data!I31>Status!$T$1,Status!$T21=\"↓\"),-1,IF(AND(Data!I31>=Status!$T$2,Status!$T21=\"↓\"),0,IF(AND(Data!I31<=Status!$T$2,Status!$T21=\"↓\"),1))))))))","v":""},{"$f":"IF($C21=\"\",\"\",IF(Data!J29=\"\",\"\",IF(AND(Data!J31<Status!$T$3,Status!$T21=\"↑\"),-1,IF(AND(Data!J31<Status!$T$2,Status!$T21=\"↑\"),0,IF(AND(Data!J31>=Status!$T$2,Status!$T21=\"↑\"),1,IF(AND(Data!J31>Status!$T$1,Status!$T21=\"↓\"),-1,IF(AND(Data!J31>=Status!$T$2,Status!$T21=\"↓\"),0,IF(AND(Data!J31<=Status!$T$2,Status!$T21=\"↓\"),1))))))))","v":""},{"$f":"IF($C21=\"\",\"\",IF(Data!K29=\"\",\"\",IF(AND(Data!K31<Status!$T$3,Status!$T21=\"↑\"),-1,IF(AND(Data!K31<Status!$T$2,Status!$T21=\"↑\"),0,IF(AND(Data!K31>=Status!$T$2,Status!$T21=\"↑\"),1,IF(AND(Data!K31>Status!$T$1,Status!$T21=\"↓\"),-1,IF(AND(Data!K31>=Status!$T$2,Status!$T21=\"↓\"),0,IF(AND(Data!K31<=Status!$T$2,Status!$T21=\"↓\"),1))))))))","v":""},{"$f":"IF($C21=\"\",\"\",IF(Data!L29=\"\",\"\",IF(AND(Data!L31<Status!$T$3,Status!$T21=\"↑\"),-1,IF(AND(Data!L31<Status!$T$2,Status!$T21=\"↑\"),0,IF(AND(Data!L31>=Status!$T$2,Status!$T21=\"↑\"),1,IF(AND(Data!L31>Status!$T$1,Status!$T21=\"↓\"),-1,IF(AND(Data!L31>=Status!$T$2,Status!$T21=\"↓\"),0,IF(AND(Data!L31<=Status!$T$2,Status!$T21=\"↓\"),1))))))))","v":""},{"$f":"IF($C21=\"\",\"\",IF(Data!M29=\"\",\"\",IF(AND(Data!M31<Status!$T$3,Status!$T21=\"↑\"),-1,IF(AND(Data!M31<Status!$T$2,Status!$T21=\"↑\"),0,IF(AND(Data!M31>=Status!$T$2,Status!$T21=\"↑\"),1,IF(AND(Data!M31>Status!$T$1,Status!$T21=\"↓\"),-1,IF(AND(Data!M31>=Status!$T$2,Status!$T21=\"↓\"),0,IF(AND(Data!M31<=Status!$T$2,Status!$T21=\"↓\"),1))))))))","v":""},{"$f":"IF($C21=\"\",\"\",IF(Data!N29=\"\",\"\",IF(AND(Data!N31<Status!$T$3,Status!$T21=\"↑\"),-1,IF(AND(Data!N31<Status!$T$2,Status!$T21=\"↑\"),0,IF(AND(Data!N31>=Status!$T$2,Status!$T21=\"↑\"),1,IF(AND(Data!N31>Status!$T$1,Status!$T21=\"↓\"),-1,IF(AND(Data!N31>=Status!$T$2,Status!$T21=\"↓\"),0,IF(AND(Data!N31<=Status!$T$2,Status!$T21=\"↓\"),1))))))))","v":""},{"$f":"IF($C21=\"\",\"\",IF(Data!O29=\"\",\"\",IF(AND(Data!O31<Status!$T$3,Status!$T21=\"↑\"),-1,IF(AND(Data!O31<Status!$T$2,Status!$T21=\"↑\"),0,IF(AND(Data!O31>=Status!$T$2,Status!$T21=\"↑\"),1,IF(AND(Data!O31>Status!$T$1,Status!$T21=\"↓\"),-1,IF(AND(Data!O31>=Status!$T$2,Status!$T21=\"↓\"),0,IF(AND(Data!O31<=Status!$T$2,Status!$T21=\"↓\"),1))))))))","v":""},{"$f":"IF($C21=\"\",\"\",IF(Data!P29=\"\",\"\",IF(AND(Data!P31<Status!$T$3,Status!$T21=\"↑\"),-1,IF(AND(Data!P31<Status!$T$2,Status!$T21=\"↑\"),0,IF(AND(Data!P31>=Status!$T$2,Status!$T21=\"↑\"),1,IF(AND(Data!P31>Status!$T$1,Status!$T21=\"↓\"),-1,IF(AND(Data!P31>=Status!$T$2,Status!$T21=\"↓\"),0,IF(AND(Data!P31<=Status!$T$2,Status!$T21=\"↓\"),1))))))))","v":""},{"$f":"IF($C21=\"\",\"\",IF(Data!Q29=\"\",\"\",IF(AND(Data!Q31<Status!$T$3,Status!$T21=\"↑\"),-1,IF(AND(Data!Q31<Status!$T$2,Status!$T21=\"↑\"),0,IF(AND(Data!Q31>=Status!$T$2,Status!$T21=\"↑\"),1,IF(AND(Data!Q31>Status!$T$1,Status!$T21=\"↓\"),-1,IF(AND(Data!Q31>=Status!$T$2,Status!$T21=\"↓\"),0,IF(AND(Data!Q31<=Status!$T$2,Status!$T21=\"↓\"),1))))))))","v":""},{"$f":"IF($C21=\"\",\"\",IF(Data!R29=\"\",\"\",IF(AND(Data!R31<Status!$T$3,Status!$T21=\"↑\"),-1,IF(AND(Data!R31<Status!$T$2,Status!$T21=\"↑\"),0,IF(AND(Data!R31>=Status!$T$2,Status!$T21=\"↑\"),1,IF(AND(Data!R31>Status!$T$1,Status!$T21=\"↓\"),-1,IF(AND(Data!R31>=Status!$T$2,Status!$T21=\"↓\"),0,IF(AND(Data!R31<=Status!$T$2,Status!$T21=\"↓\"),1))))))))","v":""},{"$f":"IF($C21=\"\",\"\",IF(Data!S29=\"\",\"\",IF(AND(Data!S31<Status!$T$3,Status!$T21=\"↑\"),-1,IF(AND(Data!S31<Status!$T$2,Status!$T21=\"↑\"),0,IF(AND(Data!S31>=Status!$T$2,Status!$T21=\"↑\"),1,IF(AND(Data!S31>Status!$T$1,Status!$T21=\"↓\"),-1,IF(AND(Data!S31>=Status!$T$2,Status!$T21=\"↓\"),0,IF(AND(Data!S31<=Status!$T$2,Status!$T21=\"↓\"),1))))))))","v":""},null,{"$f":"IF($C21=\"\",\"\",IF(Data!T29=\"\",\"\",IF(AND(Data!T31<Status!$T$3,Status!$T21=\"↑\"),-1,IF(AND(Data!T31<Status!$T$2,Status!$T21=\"↑\"),0,IF(AND(Data!T31>=Status!$T$2,Status!$T21=\"↑\"),1,IF(AND(Data!T31>Status!$T$1,Status!$T21=\"↓\"),-1,IF(AND(Data!T31>=Status!$T$2,Status!$T21=\"↓\"),0,IF(AND(Data!T31<=Status!$T$2,Status!$T21=\"↓\"),1))))))))","v":-1},{"$f":"IF($C21=\"\",\"\",IF(Data!U29=\"\",\"\",IF(AND(Data!U31<Status!$T$3,Status!$T21=\"↑\"),-1,IF(AND(Data!U31<Status!$T$2,Status!$T21=\"↑\"),0,IF(AND(Data!U31>=Status!$T$2,Status!$T21=\"↑\"),1,IF(AND(Data!U31>Status!$T$1,Status!$T21=\"↓\"),-1,IF(AND(Data!U31>=Status!$T$2,Status!$T21=\"↓\"),0,IF(AND(Data!U31<=Status!$T$2,Status!$T21=\"↓\"),1))))))))","v":-1},null,{"$f":"Indicators!H14","v":"↑"}]
[]
[null,null,{"$f":"IF(Indicators!D15=\"\",\"\",Indicators!D15)","v":"Tiempo de resolución de quejas"},{"$f":"IF($C23=\"\",\"\",IF(Data!H32=\"\",\"\",IF(AND(Data!H34<Status!$T$3,Status!$T23=\"↑\"),-1,IF(AND(Data!H34<Status!$T$2,Status!$T23=\"↑\"),0,IF(AND(Data!H34>=Status!$T$2,Status!$T23=\"↑\"),1,IF(AND(Data!H34>Status!$T$1,Status!$T23=\"↓\"),-1,IF(AND(Data!H34>=Status!$T$2,Status!$T23=\"↓\"),0,IF(AND(Data!H34<=Status!$T$2,Status!$T23=\"↓\"),1))))))))","v":""},{"$f":"IF($C23=\"\",\"\",IF(Data!I32=\"\",\"\",IF(AND(Data!I34<Status!$T$3,Status!$T23=\"↑\"),-1,IF(AND(Data!I34<Status!$T$2,Status!$T23=\"↑\"),0,IF(AND(Data!I34>=Status!$T$2,Status!$T23=\"↑\"),1,IF(AND(Data!I34>Status!$T$1,Status!$T23=\"↓\"),-1,IF(AND(Data!I34>=Status!$T$2,Status!$T23=\"↓\"),0,IF(AND(Data!I34<=Status!$T$2,Status!$T23=\"↓\"),1))))))))","v":""},{"$f":"IF($C23=\"\",\"\",IF(Data!J32=\"\",\"\",IF(AND(Data!J34<Status!$T$3,Status!$T23=\"↑\"),-1,IF(AND(Data!J34<Status!$T$2,Status!$T23=\"↑\"),0,IF(AND(Data!J34>=Status!$T$2,Status!$T23=\"↑\"),1,IF(AND(Data!J34>Status!$T$1,Status!$T23=\"↓\"),-1,IF(AND(Data!J34>=Status!$T$2,Status!$T23=\"↓\"),0,IF(AND(Data!J34<=Status!$T$2,Status!$T23=\"↓\"),1))))))))","v":""},{"$f":"IF($C23=\"\",\"\",IF(Data!K32=\"\",\"\",IF(AND(Data!K34<Status!$T$3,Status!$T23=\"↑\"),-1,IF(AND(Data!K34<Status!$T$2,Status!$T23=\"↑\"),0,IF(AND(Data!K34>=Status!$T$2,Status!$T23=\"↑\"),1,IF(AND(Data!K34>Status!$T$1,Status!$T23=\"↓\"),-1,IF(AND(Data!K34>=Status!$T$2,Status!$T23=\"↓\"),0,IF(AND(Data!K34<=Status!$T$2,Status!$T23=\"↓\"),1))))))))","v":""},{"$f":"IF($C23=\"\",\"\",IF(Data!L32=\"\",\"\",IF(AND(Data!L34<Status!$T$3,Status!$T23=\"↑\"),-1,IF(AND(Data!L34<Status!$T$2,Status!$T23=\"↑\"),0,IF(AND(Data!L34>=Status!$T$2,Status!$T23=\"↑\"),1,IF(AND(Data!L34>Status!$T$1,Status!$T23=\"↓\"),-1,IF(AND(Data!L34>=Status!$T$2,Status!$T23=\"↓\"),0,IF(AND(Data!L34<=Status!$T$2,Status!$T23=\"↓\"),1))))))))","v":""},{"$f":"IF($C23=\"\",\"\",IF(Data!M32=\"\",\"\",IF(AND(Data!M34<Status!$T$3,Status!$T23=\"↑\"),-1,IF(AND(Data!M34<Status!$T$2,Status!$T23=\"↑\"),0,IF(AND(Data!M34>=Status!$T$2,Status!$T23=\"↑\"),1,IF(AND(Data!M34>Status!$T$1,Status!$T23=\"↓\"),-1,IF(AND(Data!M34>=Status!$T$2,Status!$T23=\"↓\"),0,IF(AND(Data!M34<=Status!$T$2,Status!$T23=\"↓\"),1))))))))","v":""},{"$f":"IF($C23=\"\",\"\",IF(Data!N32=\"\",\"\",IF(AND(Data!N34<Status!$T$3,Status!$T23=\"↑\"),-1,IF(AND(Data!N34<Status!$T$2,Status!$T23=\"↑\"),0,IF(AND(Data!N34>=Status!$T$2,Status!$T23=\"↑\"),1,IF(AND(Data!N34>Status!$T$1,Status!$T23=\"↓\"),-1,IF(AND(Data!N34>=Status!$T$2,Status!$T23=\"↓\"),0,IF(AND(Data!N34<=Status!$T$2,Status!$T23=\"↓\"),1))))))))","v":""},{"$f":"IF($C23=\"\",\"\",IF(Data!O32=\"\",\"\",IF(AND(Data!O34<Status!$T$3,Status!$T23=\"↑\"),-1,IF(AND(Data!O34<Status!$T$2,Status!$T23=\"↑\"),0,IF(AND(Data!O34>=Status!$T$2,Status!$T23=\"↑\"),1,IF(AND(Data!O34>Status!$T$1,Status!$T23=\"↓\"),-1,IF(AND(Data!O34>=Status!$T$2,Status!$T23=\"↓\"),0,IF(AND(Data!O34<=Status!$T$2,Status!$T23=\"↓\"),1))))))))","v":""},{"$f":"IF($C23=\"\",\"\",IF(Data!P32=\"\",\"\",IF(AND(Data!P34<Status!$T$3,Status!$T23=\"↑\"),-1,IF(AND(Data!P34<Status!$T$2,Status!$T23=\"↑\"),0,IF(AND(Data!P34>=Status!$T$2,Status!$T23=\"↑\"),1,IF(AND(Data!P34>Status!$T$1,Status!$T23=\"↓\"),-1,IF(AND(Data!P34>=Status!$T$2,Status!$T23=\"↓\"),0,IF(AND(Data!P34<=Status!$T$2,Status!$T23=\"↓\"),1))))))))","v":""},{"$f":"IF($C23=\"\",\"\",IF(Data!Q32=\"\",\"\",IF(AND(Data!Q34<Status!$T$3,Status!$T23=\"↑\"),-1,IF(AND(Data!Q34<Status!$T$2,Status!$T23=\"↑\"),0,IF(AND(Data!Q34>=Status!$T$2,Status!$T23=\"↑\"),1,IF(AND(Data!Q34>Status!$T$1,Status!$T23=\"↓\"),-1,IF(AND(Data!Q34>=Status!$T$2,Status!$T23=\"↓\"),0,IF(AND(Data!Q34<=Status!$T$2,Status!$T23=\"↓\"),1))))))))","v":""},{"$f":"IF($C23=\"\",\"\",IF(Data!R32=\"\",\"\",IF(AND(Data!R34<Status!$T$3,Status!$T23=\"↑\"),-1,IF(AND(Data!R34<Status!$T$2,Status!$T23=\"↑\"),0,IF(AND(Data!R34>=Status!$T$2,Status!$T23=\"↑\"),1,IF(AND(Data!R34>Status!$T$1,Status!$T23=\"↓\"),-1,IF(AND(Data!R34>=Status!$T$2,Status!$T23=\"↓\"),0,IF(AND(Data!R34<=Status!$T$2,Status!$T23=\"↓\"),1))))))))","v":""},{"$f":"IF($C23=\"\",\"\",IF(Data!S32=\"\",\"\",IF(AND(Data!S34<Status!$T$3,Status!$T23=\"↑\"),-1,IF(AND(Data!S34<Status!$T$2,Status!$T23=\"↑\"),0,IF(AND(Data!S34>=Status!$T$2,Status!$T23=\"↑\"),1,IF(AND(Data!S34>Status!$T$1,Status!$T23=\"↓\"),-1,IF(AND(Data!S34>=Status!$T$2,Status!$T23=\"↓\"),0,IF(AND(Data!S34<=Status!$T$2,Status!$T23=\"↓\"),1))))))))","v":""},null,{"$f":"IF($C23=\"\",\"\",IF(Data!T32=\"\",\"\",IF(AND(Data!T34<Status!$T$3,Status!$T23=\"↑\"),-1,IF(AND(Data!T34<Status!$T$2,Status!$T23=\"↑\"),0,IF(AND(Data!T34>=Status!$T$2,Status!$T23=\"↑\"),1,IF(AND(Data!T34>Status!$T$1,Status!$T23=\"↓\"),-1,IF(AND(Data!T34>=Status!$T$2,Status!$T23=\"↓\"),0,IF(AND(Data!T34<=Status!$T$2,Status!$T23=\"↓\"),1))))))))","v":1},{"$f":"IF($C23=\"\",\"\",IF(Data!U32=\"\",\"\",IF(AND(Data!U34<Status!$T$3,Status!$T23=\"↑\"),-1,IF(AND(Data!U34<Status!$T$2,Status!$T23=\"↑\"),0,IF(AND(Data!U34>=Status!$T$2,Status!$T23=\"↑\"),1,IF(AND(Data!U34>Status!$T$1,Status!$T23=\"↓\"),-1,IF(AND(Data!U34>=Status!$T$2,Status!$T23=\"↓\"),0,IF(AND(Data!U34<=Status!$T$2,Status!$T23=\"↓\"),1))))))))","v":1},null,{"$f":"Indicators!H15","v":"↓"}]
[]
[null,null,{"$f":"IF(Indicators!D16=\"\",\"\",Indicators!D16)","v":"Tasa de litigios evitados"},{"$f":"IF($C25=\"\",\"\",IF(Data!H35=\"\",\"\",IF(AND(Data!H37<Status!$T$3,Status!$T25=\"↑\"),-1,IF(AND(Data!H37<Status!$T$2,Status!$T25=\"↑\"),0,IF(AND(Data!H37>=Status!$T$2,Status!$T25=\"↑\"),1,IF(AND(Data!H37>Status!$T$1,Status!$T25=\"↓\"),-1,IF(AND(Data!H37>=Status!$T$2,Status!$T25=\"↓\"),0,IF(AND(Data!H37<=Status!$T$2,Status!$T25=\"↓\"),1))))))))","v":""},{"$f":"IF($C25=\"\",\"\",IF(Data!I35=\"\",\"\",IF(AND(Data!I37<Status!$T$3,Status!$T25=\"↑\"),-1,IF(AND(Data!I37<Status!$T$2,Status!$T25=\"↑\"),0,IF(AND(Data!I37>=Status!$T$2,Status!$T25=\"↑\"),1,IF(AND(Data!I37>Status!$T$1,Status!$T25=\"↓\"),-1,IF(AND(Data!I37>=Status!$T$2,Status!$T25=\"↓\"),0,IF(AND(Data!I37<=Status!$T$2,Status!$T25=\"↓\"),1))))))))","v":""},{"$f":"IF($C25=\"\",\"\",IF(Data!J35=\"\",\"\",IF(AND(Data!J37<Status!$T$3,Status!$T25=\"↑\"),-1,IF(AND(Data!J37<Status!$T$2,Status!$T25=\"↑\"),0,IF(AND(Data!J37>=Status!$T$2,Status!$T25=\"↑\"),1,IF(AND(Data!J37>Status!$T$1,Status!$T25=\"↓\"),-1,IF(AND(Data!J37>=Status!$T$2,Status!$T25=\"↓\"),0,IF(AND(Data!J37<=Status!$T$2,Status!$T25=\"↓\"),1))))))))","v":""},{"$f":"IF($C25=\"\",\"\",IF(Data!K35=\"\",\"\",IF(AND(Data!K37<Status!$T$3,Status!$T25=\"↑\"),-1,IF(AND(Data!K37<Status!$T$2,Status!$T25=\"↑\"),0,IF(AND(Data!K37>=Status!$T$2,Status!$T25=\"↑\"),1,IF(AND(Data!K37>Status!$T$1,Status!$T25=\"↓\"),-1,IF(AND(Data!K37>=Status!$T$2,Status!$T25=\"↓\"),0,IF(AND(Data!K37<=Status!$T$2,Status!$T25=\"↓\"),1))))))))","v":""},{"$f":"IF($C25=\"\",\"\",IF(Data!L35=\"\",\"\",IF(AND(Data!L37<Status!$T$3,Status!$T25=\"↑\"),-1,IF(AND(Data!L37<Status!$T$2,Status!$T25=\"↑\"),0,IF(AND(Data!L37>=Status!$T$2,Status!$T25=\"↑\"),1,IF(AND(Data!L37>Status!$T$1,Status!$T25=\"↓\"),-1,IF(AND(Data!L37>=Status!$T$2,Status!$T25=\"↓\"),0,IF(AND(Data!L37<=Status!$T$2,Status!$T25=\"↓\"),1))))))))","v":""},{"$f":"IF($C25=\"\",\"\",IF(Data!M35=\"\",\"\",IF(AND(Data!M37<Status!$T$3,Status!$T25=\"↑\"),-1,IF(AND(Data!M37<Status!$T$2,Status!$T25=\"↑\"),0,IF(AND(Data!M37>=Status!$T$2,Status!$T25=\"↑\"),1,IF(AND(Data!M37>Status!$T$1,Status!$T25=\"↓\"),-1,IF(AND(Data!M37>=Status!$T$2,Status!$T25=\"↓\"),0,IF(AND(Data!M37<=Status!$T$2,Status!$T25=\"↓\"),1))))))))","v":""},{"$f":"IF($C25=\"\",\"\",IF(Data!N35=\"\",\"\",IF(AND(Data!N37<Status!$T$3,Status!$T25=\"↑\"),-1,IF(AND(Data!N37<Status!$T$2,Status!$T25=\"↑\"),0,IF(AND(Data!N37>=Status!$T$2,Status!$T25=\"↑\"),1,IF(AND(Data!N37>Status!$T$1,Status!$T25=\"↓\"),-1,IF(AND(Data!N37>=Status!$T$2,Status!$T25=\"↓\"),0,IF(AND(Data!N37<=Status!$T$2,Status!$T25=\"↓\"),1))))))))","v":""},{"$f":"IF($C25=\"\",\"\",IF(Data!O35=\"\",\"\",IF(AND(Data!O37<Status!$T$3,Status!$T25=\"↑\"),-1,IF(AND(Data!O37<Status!$T$2,Status!$T25=\"↑\"),0,IF(AND(Data!O37>=Status!$T$2,Status!$T25=\"↑\"),1,IF(AND(Data!O37>Status!$T$1,Status!$T25=\"↓\"),-1,IF(AND(Data!O37>=Status!$T$2,Status!$T25=\"↓\"),0,IF(AND(Data!O37<=Status!$T$2,Status!$T25=\"↓\"),1))))))))","v":""},{"$f":"IF($C25=\"\",\"\",IF(Data!P35=\"\",\"\",IF(AND(Data!P37<Status!$T$3,Status!$T25=\"↑\"),-1,IF(AND(Data!P37<Status!$T$2,Status!$T25=\"↑\"),0,IF(AND(Data!P37>=Status!$T$2,Status!$T25=\"↑\"),1,IF(AND(Data!P37>Status!$T$1,Status!$T25=\"↓\"),-1,IF(AND(Data!P37>=Status!$T$2,Status!$T25=\"↓\"),0,IF(AND(Data!P37<=Status!$T$2,Status!$T25=\"↓\"),1))))))))","v":""},{"$f":"IF($C25=\"\",\"\",IF(Data!Q35=\"\",\"\",IF(AND(Data!Q37<Status!$T$3,Status!$T25=\"↑\"),-1,IF(AND(Data!Q37<Status!$T$2,Status!$T25=\"↑\"),0,IF(AND(Data!Q37>=Status!$T$2,Status!$T25=\"↑\"),1,IF(AND(Data!Q37>Status!$T$1,Status!$T25=\"↓\"),-1,IF(AND(Data!Q37>=Status!$T$2,Status!$T25=\"↓\"),0,IF(AND(Data!Q37<=Status!$T$2,Status!$T25=\"↓\"),1))))))))","v":""},{"$f":"IF($C25=\"\",\"\",IF(Data!R35=\"\",\"\",IF(AND(Data!R37<Status!$T$3,Status!$T25=\"↑\"),-1,IF(AND(Data!R37<Status!$T$2,Status!$T25=\"↑\"),0,IF(AND(Data!R37>=Status!$T$2,Status!$T25=\"↑\"),1,IF(AND(Data!R37>Status!$T$1,Status!$T25=\"↓\"),-1,IF(AND(Data!R37>=Status!$T$2,Status!$T25=\"↓\"),0,IF(AND(Data!R37<=Status!$T$2,Status!$T25=\"↓\"),1))))))))","v":""},{"$f":"IF($C25=\"\",\"\",IF(Data!S35=\"\",\"\",IF(AND(Data!S37<Status!$T$3,Status!$T25=\"↑\"),-1,IF(AND(Data!S37<Status!$T$2,Status!$T25=\"↑\"),0,IF(AND(Data!S37>=Status!$T$2,Status!$T25=\"↑\"),1,IF(AND(Data!S37>Status!$T$1,Status!$T25=\"↓\"),-1,IF(AND(Data!S37>=Status!$T$2,Status!$T25=\"↓\"),0,IF(AND(Data!S37<=Status!$T$2,Status!$T25=\"↓\"),1))))))))","v":""},null,{"$f":"IF($C25=\"\",\"\",IF(Data!T35=\"\",\"\",IF(AND(Data!T37<Status!$T$3,Status!$T25=\"↑\"),-1,IF(AND(Data!T37<Status!$T$2,Status!$T25=\"↑\"),0,IF(AND(Data!T37>=Status!$T$2,Status!$T25=\"↑\"),1,IF(AND(Data!T37>Status!$T$1,Status!$T25=\"↓\"),-1,IF(AND(Data!T37>=Status!$T$2,Status!$T25=\"↓\"),0,IF(AND(Data!T37<=Status!$T$2,Status!$T25=\"↓\"),1))))))))","v":1},{"$f":"IF($C25=\"\",\"\",IF(Data!U35=\"\",\"\",IF(AND(Data!U37<Status!$T$3,Status!$T25=\"↑\"),-1,IF(AND(Data!U37<Status!$T$2,Status!$T25=\"↑\"),0,IF(AND(Data!U37>=Status!$T$2,Status!$T25=\"↑\"),1,IF(AND(Data!U37>Status!$T$1,Status!$T25=\"↓\"),-1,IF(AND(Data!U37>=Status!$T$2,Status!$T25=\"↓\"),0,IF(AND(Data!U37<=Status!$T$2,Status!$T25=\"↓\"),1))))))))","v":1},null,{"$f":"Indicators!H16","v":"↓"}]
[]
[null,null,{"$f":"IF(Indicators!D17=\"\",\"\",Indicators!D17)","v":"Retorno de inversión de nuevos proyectos"},{"$f":"IF($C27=\"\",\"\",IF(Data!H38=\"\",\"\",IF(AND(Data!H40<Status!$T$3,Status!$T27=\"↑\"),-1,IF(AND(Data!H40<Status!$T$2,Status!$T27=\"↑\"),0,IF(AND(Data!H40>=Status!$T$2,Status!$T27=\"↑\"),1,IF(AND(Data!H40>Status!$T$1,Status!$T27=\"↓\"),-1,IF(AND(Data!H40>=Status!$T$2,Status!$T27=\"↓\"),0,IF(AND(Data!H40<=Status!$T$2,Status!$T27=\"↓\"),1))))))))","v":""},{"$f":"IF($C27=\"\",\"\",IF(Data!I38=\"\",\"\",IF(AND(Data!I40<Status!$T$3,Status!$T27=\"↑\"),-1,IF(AND(Data!I40<Status!$T$2,Status!$T27=\"↑\"),0,IF(AND(Data!I40>=Status!$T$2,Status!$T27=\"↑\"),1,IF(AND(Data!I40>Status!$T$1,Status!$T27=\"↓\"),-1,IF(AND(Data!I40>=Status!$T$2,Status!$T27=\"↓\"),0,IF(AND(Data!I40<=Status!$T$2,Status!$T27=\"↓\"),1))))))))","v":""},{"$f":"IF($C27=\"\",\"\",IF(Data!J38=\"\",\"\",IF(AND(Data!J40<Status!$T$3,Status!$T27=\"↑\"),-1,IF(AND(Data!J40<Status!$T$2,Status!$T27=\"↑\"),0,IF(AND(Data!J40>=Status!$T$2,Status!$T27=\"↑\"),1,IF(AND(Data!J40>Status!$T$1,Status!$T27=\"↓\"),-1,IF(AND(Data!J40>=Status!$T$2,Status!$T27=\"↓\"),0,IF(AND(Data!J40<=Status!$T$2,Status!$T27=\"↓\"),1))))))))","v":""},{"$f":"IF($C27=\"\",\"\",IF(Data!K38=\"\",\"\",IF(AND(Data!K40<Status!$T$3,Status!$T27=\"↑\"),-1,IF(AND(Data!K40<Status!$T$2,Status!$T27=\"↑\"),0,IF(AND(Data!K40>=Status!$T$2,Status!$T27=\"↑\"),1,IF(AND(Data!K40>Status!$T$1,Status!$T27=\"↓\"),-1,IF(AND(Data!K40>=Status!$T$2,Status!$T27=\"↓\"),0,IF(AND(Data!K40<=Status!$T$2,Status!$T27=\"↓\"),1))))))))","v":""},{"$f":"IF($C27=\"\",\"\",IF(Data!L38=\"\",\"\",IF(AND(Data!L40<Status!$T$3,Status!$T27=\"↑\"),-1,IF(AND(Data!L40<Status!$T$2,Status!$T27=\"↑\"),0,IF(AND(Data!L40>=Status!$T$2,Status!$T27=\"↑\"),1,IF(AND(Data!L40>Status!$T$1,Status!$T27=\"↓\"),-1,IF(AND(Data!L40>=Status!$T$2,Status!$T27=\"↓\"),0,IF(AND(Data!L40<=Status!$T$2,Status!$T27=\"↓\"),1))))))))","v":""},{"$f":"IF($C27=\"\",\"\",IF(Data!M38=\"\",\"\",IF(AND(Data!M40<Status!$T$3,Status!$T27=\"↑\"),-1,IF(AND(Data!M40<Status!$T$2,Status!$T27=\"↑\"),0,IF(AND(Data!M40>=Status!$T$2,Status!$T27=\"↑\"),1,IF(AND(Data!M40>Status!$T$1,Status!$T27=\"↓\"),-1,IF(AND(Data!M40>=Status!$T$2,Status!$T27=\"↓\"),0,IF(AND(Data!M40<=Status!$T$2,Status!$T27=\"↓\"),1))))))))","v":""},{"$f":"IF($C27=\"\",\"\",IF(Data!N38=\"\",\"\",IF(AND(Data!N40<Status!$T$3,Status!$T27=\"↑\"),-1,IF(AND(Data!N40<Status!$T$2,Status!$T27=\"↑\"),0,IF(AND(Data!N40>=Status!$T$2,Status!$T27=\"↑\"),1,IF(AND(Data!N40>Status!$T$1,Status!$T27=\"↓\"),-1,IF(AND(Data!N40>=Status!$T$2,Status!$T27=\"↓\"),0,IF(AND(Data!N40<=Status!$T$2,Status!$T27=\"↓\"),1))))))))","v":""},{"$f":"IF($C27=\"\",\"\",IF(Data!O38=\"\",\"\",IF(AND(Data!O40<Status!$T$3,Status!$T27=\"↑\"),-1,IF(AND(Data!O40<Status!$T$2,Status!$T27=\"↑\"),0,IF(AND(Data!O40>=Status!$T$2,Status!$T27=\"↑\"),1,IF(AND(Data!O40>Status!$T$1,Status!$T27=\"↓\"),-1,IF(AND(Data!O40>=Status!$T$2,Status!$T27=\"↓\"),0,IF(AND(Data!O40<=Status!$T$2,Status!$T27=\"↓\"),1))))))))","v":""},{"$f":"IF($C27=\"\",\"\",IF(Data!P38=\"\",\"\",IF(AND(Data!P40<Status!$T$3,Status!$T27=\"↑\"),-1,IF(AND(Data!P40<Status!$T$2,Status!$T27=\"↑\"),0,IF(AND(Data!P40>=Status!$T$2,Status!$T27=\"↑\"),1,IF(AND(Data!P40>Status!$T$1,Status!$T27=\"↓\"),-1,IF(AND(Data!P40>=Status!$T$2,Status!$T27=\"↓\"),0,IF(AND(Data!P40<=Status!$T$2,Status!$T27=\"↓\"),1))))))))","v":""},{"$f":"IF($C27=\"\",\"\",IF(Data!Q38=\"\",\"\",IF(AND(Data!Q40<Status!$T$3,Status!$T27=\"↑\"),-1,IF(AND(Data!Q40<Status!$T$2,Status!$T27=\"↑\"),0,IF(AND(Data!Q40>=Status!$T$2,Status!$T27=\"↑\"),1,IF(AND(Data!Q40>Status!$T$1,Status!$T27=\"↓\"),-1,IF(AND(Data!Q40>=Status!$T$2,Status!$T27=\"↓\"),0,IF(AND(Data!Q40<=Status!$T$2,Status!$T27=\"↓\"),1))))))))","v":""},{"$f":"IF($C27=\"\",\"\",IF(Data!R38=\"\",\"\",IF(AND(Data!R40<Status!$T$3,Status!$T27=\"↑\"),-1,IF(AND(Data!R40<Status!$T$2,Status!$T27=\"↑\"),0,IF(AND(Data!R40>=Status!$T$2,Status!$T27=\"↑\"),1,IF(AND(Data!R40>Status!$T$1,Status!$T27=\"↓\"),-1,IF(AND(Data!R40>=Status!$T$2,Status!$T27=\"↓\"),0,IF(AND(Data!R40<=Status!$T$2,Status!$T27=\"↓\"),1))))))))","v":""},{"$f":"IF($C27=\"\",\"\",IF(Data!S38=\"\",\"\",IF(AND(Data!S40<Status!$T$3,Status!$T27=\"↑\"),-1,IF(AND(Data!S40<Status!$T$2,Status!$T27=\"↑\"),0,IF(AND(Data!S40>=Status!$T$2,Status!$T27=\"↑\"),1,IF(AND(Data!S40>Status!$T$1,Status!$T27=\"↓\"),-1,IF(AND(Data!S40>=Status!$T$2,Status!$T27=\"↓\"),0,IF(AND(Data!S40<=Status!$T$2,Status!$T27=\"↓\"),1))))))))","v":""},null,{"$f":"IF($C27=\"\",\"\",IF(Data!T38=\"\",\"\",IF(AND(Data!T40<Status!$T$3,Status!$T27=\"↑\"),-1,IF(AND(Data!T40<Status!$T$2,Status!$T27=\"↑\"),0,IF(AND(Data!T40>=Status!$T$2,Status!$T27=\"↑\"),1,IF(AND(Data!T40>Status!$T$1,Status!$T27=\"↓\"),-1,IF(AND(Data!T40>=Status!$T$2,Status!$T27=\"↓\"),0,IF(AND(Data!T40<=Status!$T$2,Status!$T27=\"↓\"),1))))))))","v":-1},{"$f":"IF($C27=\"\",\"\",IF(Data!U38=\"\",\"\",IF(AND(Data!U40<Status!$T$3,Status!$T27=\"↑\"),-1,IF(AND(Data!U40<Status!$T$2,Status!$T27=\"↑\"),0,IF(AND(Data!U40>=Status!$T$2,Status!$T27=\"↑\"),1,IF(AND(Data!U40>Status!$T$1,Status!$T27=\"↓\"),-1,IF(AND(Data!U40>=Status!$T$2,Status!$T27=\"↓\"),0,IF(AND(Data!U40<=Status!$T$2,Status!$T27=\"↓\"),1))))))))","v":-1},null,{"$f":"Indicators!H17","v":"↑"}]

{"sheet":"Aux","index":7,"n_rows":51,"n_cols":14,"rows_kept":51,"cut":false,"hidden":false,"merged":[]}
[]
[null,null,null,null,null,null,{"$f":"OFFSET(Aux!$C$4,,,,COUNTIFS(Aux!$C$4:$N$4,\"<>\"&\"\",Aux!$C$4:$N$4,\"<>*\",Aux!$C$4:$N$4,\"<>#N/A\"))","v":0.25}]
[{"$f":"Dashboard!D4","v":"TOTAL"},{"$f":"Indicators!C4","v":0},{"$f":"Data!H4","v":"ENE"},{"$f":"Data!I4","v":"FEB"},{"$f":"Data!J4","v":"MAR"},{"$f":"Data!K4","v":"ABR"},{"$f":"Data!L4","v":"MAY"},{"$f":"Data!M4","v":"JUN"},{"$f":"Data!N4","v":"JUL"},{"$f":"Data!O4","v":"AGO"},{"$f":"Data!P4","v":"SEP"},{"$f":"Data!Q4","v":"OCT"},{"$f":"Data!R4","v":"NOV"},{"$f":"Data!S4","v":"DIC"}]
[null,"Red",{"$f":"IF(Data!H$5=\"\",NA(),IF(AND($A3=List!$A$14,Status!$Q$5=-1),Data!H$5,IF(AND($A3=List!$A$15,Status!$R$5=-1),Data!H$5,0)))","v":0.16},{"$f":"IF(Data!I$5=\"\",NA(),IF(AND($A3=List!$A$14,Status!$Q$5=-1),Data!I$5,IF(AND($A3=List!$A$15,Status!$R$5=-1),Data!I$5,NA())))","v":0.03},{"$f":"IF(Data!J$5=\"\",NA(),IF(AND($A3=List!$A$14,Status!$Q$5=-1),Data!J$5,IF(AND($A3=List!$A$15,Status!$R$5=-1),Data!J$5,NA())))","v":0.13},{"$f":"IF(Data!K$5=\"\",NA(),IF(AND($A3=List!$A$14,Status!$Q$5=-1),Data!K$5,IF(AND($A3=List!$A$15,Status!$R$5=-1),Data!K$5,NA())))","v":0.11},{"$f":"IF(Data!L$5=\"\",NA(),IF(AND($A3=List!$A$14,Status!$Q$5=-1),Data!L$5,IF(AND($A3=List!$A$15,Status!$R$5=-1),Data!L$5,NA())))","v":0.25},{"$f":"IF(Data!M$5=\"\",NA(),IF(AND($A3=List!$A$14,Status!$Q$5=-1),Data!M$5,IF(AND($A3=List!$A$15,Status!$R$5=-1),Data!M$5,NA())))","v":0.1},{"$f":"IF(Data!N$5=\"\",NA(),IF(AND($A3=List!$A$14,Status!$Q$5=-1),Data!N$5,IF(AND($A3=List!$A$15,Status!$R$5=-1),Data!N$5,NA())))","v":0.1},{"$f":"IF(Data!O$5=\"\",NA(),IF(AND($A3=List!$A$14,Status!$Q$5=-1),Data!O$5,IF(AND($A3=List!$A$15,Status!$R$5=-1),Data!O$5,NA())))","v":0.06},{"$f":"IF(Data!P$5=\"\",NA(),IF(AND($A3=List!$A$14,Status!$Q$5=-1),Data!P$5,IF(AND($A3=List!$A$15,Status!$R$5=-1),Data!P$5,NA())))","v":{"$error":"#N/A"}},{"$f":"IF(Data!Q$5=\"\",NA(),IF(AND($A3=List!$A$14,Status!$Q$5=-1),Data!Q$5,IF(AND($A3=List!$A$15,Status!$R$5=-1),Data!Q$5,NA())))","v":{"$error":"#N/A"}},{"$f":"IF(Data!R$5=\"\",NA(),IF(AND($A3=List!$A$14,Status!$Q$5=-1),Data!R$5,IF(AND($A3=List!$A$15,Status!$R$5=-1),Data!R$5,NA())))","v":{"$error":"#N/A"}},{"$f":"IF(Data!S$5=\"\",NA(),IF(AND($A3=List!$A$14,Status!$Q$5=-1),Data!S$5,IF(AND($A3=List!$A$15,Status!$R$5=-1),Data!S$5,NA())))","v":{"$error":"#N/A"}}]
[null,"Yellow",{"$f":"IF(Data!H$5=\"\",NA(),IF(AND($A3=List!$A$14,Status!$Q$5=0),Data!H$5,IF(AND($A3=List!$A$15,Status!$R$5=0),Data!H$5,0)))","v":0},{"$f":"IF(Data!I$5=\"\",NA(),IF(AND($A3=List!$A$14,Status!$Q$5=0),Data!I$5,IF(AND($A3=List!$A$15,Status!$R$5=0),Data!I$5,NA())))","v":{"$error":"#N/A"}},{"$f":"IF(Data!J$5=\"\",NA(),IF(AND($A3=List!$A$14,Status!$Q$5=0),Data!J$5,IF(AND($A3=List!$A$15,Status!$R$5=0),Data!J$5,NA())))","v":{"$error":"#N/A"}},{"$f":"IF(Data!K$5=\"\",NA(),IF(AND($A3=List!$A$14,Status!$Q$5=0),Data!K$5,IF(AND($A3=List!$A$15,Status!$R$5=0),Data!K$5,NA())))","v":{"$error":"#N/A"}},{"$f":"IF(Data!L$5=\"\",NA(),IF(AND($A3=List!$A$14,Status!$Q$5=0),Data!L$5,IF(AND($A3=List!$A$15,Status!$R$5=0),Data!L$5,NA())))","v":{"$error":"#N/A"}},{"$f":"IF(Data!M$5=\"\",NA(),IF(AND($A3=List!$A$14,Status!$Q$5=0),Data!M$5,IF(AND($A3=List!$A$15,Status!$R$5=0),Data!M$5,NA())))","v":{"$error":"#N/A"}},{"$f":"IF(Data!N$5=\"\",NA(),IF(AND($A3=List!$A$14,Status!$Q$5=0),Data!N$5,IF(AND($A3=List!$A$15,Status!$R$5=0),Data!N$5,NA())))","v":{"$error":"#N/A"}},{"$f":"IF(Data!O$5=\"\",NA(),IF(AND($A3=List!$A$14,Status!$Q$5=0),Data!O$5,IF(AND($A3=List!$A$15,Status!$R$5=0),Data!O$5,NA())))","v":{"$error":"#N/A"}},{"$f":"IF(Data!P$5=\"\",NA(),IF(AND($A3=List!$A$14,Status!$Q$5=0),Data!P$5,IF(AND($A3=List!$A$15,Status!$R$5=0),Data!P$5,NA())))","v":{"$error":"#N/A"}},{"$f":"IF(Data!Q$5=\"\",NA(),IF(AND($A3=List!$A$14,Status!$Q$5=0),Data!Q$5,IF(AND($A3=List!$A$15,Status!$R$5=0),Data!Q$5,NA())))","v":{"$error":"#N/A"}},{"$f":"IF(Data!R$5=\"\",NA(),IF(AND($A3=List!$A$14,Status!$Q$5=0),Data!R$5,IF(AND($A3=List!$A$15,Status!$R$5=0),Data!R$5,NA())))","v":{"$error":"#N/A"}},{"$f":"IF(Data!S$5=\"\",NA(),IF(AND($A3=List!$A$14,Status!$Q$5=0),Data!S$5,IF(AND($A3=List!$A$15,Status!$R$5=0),Data!S$5,NA())))","v":{"$error":"#N/A"}}]
[null,"Green",{"$f":"IF(Data!H$5=\"\",NA(),IF(AND($A3=List!$A$14,Status!$Q$5=1),Data!H$5,IF(AND($A3=List!$A$15,Status!$R$5=1),Data!H$5,0)))","v":0},{"$f":"IF(Data!I$5=\"\",NA(),IF(AND($A3=List!$A$14,Status!$Q$5=1),Data!I$5,IF(AND($A3=List!$A$15,Status!$R$5=1),Data!I$5,NA())))","v":{"$error":"#N/A"}},{"$f":"IF(Data!J$5=\"\",NA(),IF(AND($A3=List!$A$14,Status!$Q$5=1),Data!J$5,IF(AND($A3=List!$A$15,Status!$R$5=1),Data!J$5,NA())))","v":{"$error":"#N/A"}},{"$f":"IF(Data!K$5=\"\",NA(),IF(AND($A3=List!$A$14,Status!$Q$5=1),Data!K$5,IF(AND($A3=List!$A$15,Status!$R$5=1),Data!K$5,NA())))","v":{"$error":"#N/A"}},{"$f":"IF(Data!L$5=\"\",NA(),IF(AND($A3=List!$A$14,Status!$Q$5=1),Data!L$5,IF(AND($A3=List!$A$15,Status!$R$5=1),Data!L$5,NA())))","v":{"$error":"#N/A"}},{"$f":"IF(Data!M$5=\"\",NA(),IF(AND($A3=List!$A$14,Status!$Q$5=1),Data!M$5,IF(AND($A3=List!$A$15,Status!$R$5=1),Data!M$5,NA())))","v":{"$error":"#N/A"}},{"$f":"IF(Data!N$5=\"\",NA(),IF(AND($A3=List!$A$14,Status!$Q$5=1),Data!N$5,IF(AND($A3=List!$A$15,Status!$R$5=1),Data!N$5,NA())))","v":{"$error":"#N/A"}},{"$f":"IF(Data!O$5=\"\",NA(),IF(AND($A3=List!$A$14,Status!$Q$5=1),Data!O$5,IF(AND($A3=List!$A$15,Status!$R$5=1),Data!O$5,NA())))","v":{"$error":"#N/A"}},{"$f":"IF(Data!P$5=\"\",NA(),IF(AND($A3=List!$A$14,Status!$Q$5=1),Data!P$5,IF(AND($A3=List!$A$15,Status!$R$5=1),Data!P$5,NA())))","v":{"$error":"#N/A"}},{"$f":"IF(Data!Q$5=\"\",NA(),IF(AND($A3=List!$A$14,Status!$Q$5=1),Data!Q$5,IF(AND($A3=List!$A$15,Status!$R$5=1),Data!Q$5,NA())))","v":{"$error":"#N/A"}},{"$f":"IF(Data!R$5=\"\",NA(),IF(AND($A3=List!$A$14,Status!$Q$5=1),Data!R$5,IF(AND($A3=List!$A$15,Status!$R$5=1),Data!R$5,NA())))","v":{"$error":"#N/A"}},{"$f":"IF(Data!S$5=\"\",NA(),IF(AND($A3=List!$A$14,Status!$Q$5=1),Data!S$5,IF(AND($A3=List!$A$15,Status!$R$5=1),Data!S$5,NA())))","v":{"$error":"#N/A"}}]
[{"$f":"Dashboard!W4","v":false},{"$f":"Data!G6","v":"Meta"},{"$f":"IF(Data!H6=\"\",0,IF($A$7=FALSE,0,Data!H6))","v":0},{"$f":"IF(Data!I6=\"\",NA(),IF($A$7=FALSE,NA(),Data!I6))","v":{"$error":"#N/A"}},{"$f":"IF(Data!J6=\"\",NA(),IF($A$7=FALSE,NA(),Data!J6))","v":{"$error":"#N/A"}},{"$f":"IF(Data!K6=\"\",NA(),IF($A$7=FALSE,NA(),Data!K6))","v":{"$error":"#N/A"}},{"$f":"IF(Data!L6=\"\",NA(),IF($A$7=FALSE,NA(),Data!L6))","v":{"$error":"#N/A"}},{"$f":"IF(Data!M6=\"\",NA(),IF($A$7=FALSE,NA(),Data!M6))","v":{"$error":"#N/A"}},{"$f":"IF(Data!N6=\"\",NA(),IF($A$7=FALSE,NA(),Data!N6))","v":{"$error":"#N/A"}},{"$f":"IF(Data!O6=\"\",NA(),IF($A$7=FALSE,NA(),Data!O6))","v":{"$error":"#N/A"}},{"$f":"IF(Data!P6=\"\",NA(),IF($A$7=FALSE,NA(),Data!P6))","v":{"$error":"#N/A"}},{"$f":"IF(Data!Q6=\"\",NA(),IF($A$7=FALSE,NA(),Data!Q6))","v":{"$error":"#N/A"}},{"$f":"IF(Data!R6=\"\",NA(),IF($A$7=FALSE,NA(),Data!R6))","v":{"$error":"#N/A"}},{"$f":"IF(Data!S6=\"\",NA(),IF($A$7=FALSE,NA(),Data!S6))","v":{"$error":"#N/A"}}]
[null,"Red",{"$f":"IF(Data!H$8=\"\",0,IF(AND($A$3=List!$A$14,Status!$Q$7=-1),Data!H$8,IF(AND($A$3=List!$A$15,Status!$R$7=-1),Data!H$8,0)))","v":0},{"$f":"IF(Data!I$8=\"\",NA(),IF(AND($A$3=List!$A$14,Status!$Q$7=-1),Data!I$8,IF(AND($A$3=List!$A$15,Status!$R$7=-1),Data!I$8,NA())))","v":{"$error":"#N/A"}},{"$f":"IF(Data!J$8=\"\",NA(),IF(AND($A$3=List!$A$14,Status!$Q$7=-1),Data!J$8,IF(AND($A$3=List!$A$15,Status!$R$7=-1),Data!J$8,NA())))","v":{"$error":"#N/A"}},{"$f":"IF(Data!K$8=\"\",NA(),IF(AND($A$3=List!$A$14,Status!$Q$7=-1),Data!K$8,IF(AND($A$3=List!$A$15,Status!$R$7=-1),Data!K$8,NA())))","v":{"$error":"#N/A"}},{"$f":"IF(Data!L$8=\"\",NA(),IF(AND($A$3=List!$A$14,Status!$Q$7=-1),Data!L$8,IF(AND($A$3=List!$A$15,Status!$R$7=-1),Data!L$8,NA())))","v":{"$error":"#N/A"}},{"$f":"IF(Data!M$8=\"\",NA(),IF(AND($A$3=List!$A$14,Status!$Q$7=-1),Data!M$8,IF(AND($A$3=List!$A$15,Status!$R$7=-1),Data!M$8,NA())))","v":{"$error":"#N/A"}},{"$f":"IF(Data!N$8=\"\",NA(),IF(AND($A$3=List!$A$14,Status!$Q$7=-1),Data!N$8,IF(AND($A$3=List!$A$15,Status!$R$7=-1),Data!N$8,NA())))","v":{"$error":"#N/A"}},{"$f":"IF(Data!O$8=\"\",NA(),IF(AND($A$3=List!$A$14,Status!$Q$7=-1),Data!O$8,IF(AND($A$3=List!$A$15,Status!$R$7=-1),Data!O$8,NA())))","v":{"$error":"#N/A"}},{"$f":"IF(Data!P$8=\"\",NA(),IF(AND($A$3=List!$A$14,Status!$Q$7=-1),Data!P$8,IF(AND($A$3=List!$A$15,Status!$R$7=-1),Data!P$8,NA())))","v":{"$error":"#N/A"}},{"$f":"IF(Data!Q$8=\"\",NA(),IF(AND($A$3=List!$A$14,Status!$Q$7=-1),Data!Q$8,IF(AND($A$3=List!$A$15,Status!$R$7=-1),Data!Q$8,NA())))","v":{"$error":"#N/A"}},{"$f":"IF(Data!R$8=\"\",NA(),IF(AND($A$3=List!$A$14,Status!$Q$7=-1),Data!R$8,IF(AND($A$3=List!$A$15,Status!$R$7=-1),Data!R$8,NA())))","v":{"$error":"#N/A"}},{"$f":"IF(Data!S$8=\"\",NA(),IF(AND($A$3=List!$A$14,Status!$Q$7=-1),Data!S$8,IF(AND($A$3=List!$A$15,Status!$R$7=-1),Data!S$8,NA())))","v":{"$error":"#N/A"}}]
[null,"Yellow",{"$f":"IF(Data!H$8=\"\",0,IF(AND($A$3=List!$A$14,Status!$Q$7=0),Data!H$8,IF(AND($A$3=List!$A$15,Status!$R$7=0),Data!H$8,0)))","v":0},{"$f":"IF(Data!I$8=\"\",NA(),IF(AND($A$3=List!$A$14,Status!$Q$7=0),Data!I$8,IF(AND($A$3=List!$A$15,Status!$R$7=0),Data!I$8,NA())))","v":{"$error":"#N/A"}},{"$f":"IF(Data!J$8=\"\",NA(),IF(AND($A$3=List!$A$14,Status!$Q$7=0),Data!J$8,IF(AND($A$3=List!$A$15,Status!$R$7=0),Data!J$8,NA())))","v":{"$error":"#N/A"}},{"$f":"IF(Data!K$8=\"\",NA(),IF(AND($A$3=List!$A$14,Status!$Q$7=0),Data!K$8,IF(AND($A$3=List!$A$15,Status!$R$7=0),Data!K$8,NA())))","v":{"$error":"#N/A"}},{"$f":"IF(Data!L$8=\"\",NA(),IF(AND($A$3=List!$A$14,Status!$Q$7=0),Data!L$8,IF(AND($A$3=List!$A$15,Status!$R$7=0),Data!L$8,NA())))","v":{"$error":"#N/A"}},{"$f":"IF(Data!M$8=\"\",NA(),IF(AND($A$3=List!$A$14,Status!$Q$7=0),Data!M$8,IF(AND($A$3=List!$A$15,Status!$R$7=0),Data!M$8,NA())))","v":{"$error":"#N/A"}},{"$f":"IF(Data!N$8=\"\",NA(),IF(AND($A$3=List!$A$14,Status!$Q$7=0),Data!N$8,IF(AND($A$3=List!$A$15,Status!$R$7=0),Data!N$8,NA())))","v":{"$error":"#N/A"}},{"$f":"IF(Data!O$8=\"\",NA(),IF(AND($A$3=List!$A$14,Status!$Q$7=0),Data!O$8,IF(AND($A$3=List!$A$15,Status!$R$7=0),Data!O$8,NA())))","v":{"$error":"#N/A"}},{"$f":"IF(Data!P$8=\"\",NA(),IF(AND($A$3=List!$A$14,Status!$Q$7=0),Data!P$8,IF(AND($A$3=List!$A$15,Status!$R$7=0),Data!P$8,NA())))","v":{"$error":"#N/A"}},{"$f":"IF(Data!Q$8=\"\",NA(),IF(AND($A$3=List!$A$14,Status!$Q$7=0),Data!Q$8,IF(AND($A$3=List!$A$15,Status!$R$7=0),Data!Q$8,NA())))","v":{"$error":"#N/A"}},{"$f":"IF(Data!R$8=\"\",NA(),IF(AND($A$3=List!$A$14,Status!$Q$7=0),Data!R$8,IF(AND($A$3=List!$A$15,Status!$R$7=0),Data!R$8,NA())))","v":{"$error":"#N/A"}},{"$f":"IF(Data!S$8=\"\",NA(),IF(AND($A$3=List!$A$14,Status!$Q$7=0),Data!S$8,IF(AND($A$3=List!$A$15,Status!$R$7=0),Data!S$8,NA())))","v":{"$error":"#N/A"}}]
[null,"Green",{"$f":"IF(Data!H$8=\"\",0,IF(AND($A$3=List!$A$14,Status!$Q$7=1),Data!H$8,IF(AND($A$3=List!$A$15,Status!$R$7=1),Data!H$8,0)))","v":0},{"$f":"IF(Data!I$8=\"\",NA(),IF(AND($A$3=List!$A$14,Status!$Q$7=1),Data!I$8,IF(AND($A$3=List!$A$15,Status!$R$7=1),Data!I$8,NA())))","v":{"$error":"#N/A"}},{"$f":"IF(Data!J$8=\"\",NA(),IF(AND($A$3=List!$A$14,Status!$Q$7=1),Data!J$8,IF(AND($A$3=List!$A$15,Status!$R$7=1),Data!J$8,NA())))","v":{"$error":"#N/A"}},{"$f":"IF(Data!K$8=\"\",NA(),IF(AND($A$3=List!$A$14,Status!$Q$7=1),Data!K$8,IF(AND($A$3=List!$A$15,Status!$R$7=1),Data!K$8,NA())))","v":{"$error":"#N/A"}},{"$f":"IF(Data!L$8=\"\",NA(),IF(AND($A$3=List!$A$14,Status!$Q$7=1),Data!L$8,IF(AND($A$3=List!$A$15,Status!$R$7=1),Data!L$8,NA())))","v":{"$error":"#N/A"}},{"$f":"IF(Data!M$8=\"\",NA(),IF(AND($A$3=List!$A$14,Status!$Q$7=1),Data!M$8,IF(AND($A$3=List!$A$15,Status!$R$7=1),Data!M$8,NA())))","v":{"$error":"#N/A"}},{"$f":"IF(Data!N$8=\"\",NA(),IF(AND($A$3=List!$A$14,Status!$Q$7=1),Data!N$8,IF(AND($A$3=List!$A$15,Status!$R$7=1),Data!N$8,NA())))","v":{"$error":"#N/A"}},{"$f":"IF(Data!O$8=\"\",NA(),IF(AND($A$3=List!$A$14,Status!$Q$7=1),Data!O$8,IF(AND($A$3=List!$A$15,Status!$R$7=1),Data!O$8,NA())))","v":{"$error":"#N/A"}},{"$f":"IF(Data!P$8=\"\",NA(),IF(AND($A$3=List!$A$14,Status!$Q$7=1),Data!P$8,IF(AND($A$3=List!$A$15,Status!$R$7=1),Data!P$8,NA())))","v":{"$error":"#N/A"}},{"$f":"IF(Data!Q$8=\"\",NA(),IF(AND($A$3=List!$A$14,Status!$Q$7=1),Data!Q$8,IF(AND($A$3=List!$A$15,Status!$R$7=1),Data!Q$8,NA())))","v":{"$error":"#N/A"}},{"$f":"IF(Data!R$8=\"\",NA(),IF(AND($A$3=List!$A$14,Status!$Q$7=1),Data!R$8,IF(AND($A$3=List!$A$15,Status!$R$7=1),Data!R$8,NA())))","v":{"$error":"#N/A"}},{"$f":"IF(Data!S$8=\"\",NA(),IF(AND($A$3=List!$A$14,Status!$Q$7=1),Data!S$8,IF(AND($A$3=List!$A$15,Status!$R$7=1),Data!S$8,NA())))","v":{"$error":"#N/A"}}]
[{"$f":"A7","v":false},{"$f":"B7","v":"Meta"},{"$f":"IF(Data!H9=\"\",0,IF($A$11=FALSE,0,Data!H9))","v":0},{"$f":"IF(Data!I9=\"\",NA(),IF($A$11=FALSE,NA(),Data!I9))","v":{"$error":"#N/A"}},{"$f":"IF(Data!J9=\"\",NA(),IF($A$11=FALSE,NA(),Data!J9))","v":{"$error":"#N/A"}},{"$f":"IF(Data!K9=\"\",NA(),IF($A$11=FALSE,NA(),Data!K9))","v":{"$error":"#N/A"}},{"$f":"IF(Data!L9=\"\",NA(),IF($A$11=FALSE,NA(),Data!L9))","v":{"$error":"#N/A"}},{"$f":"IF(Data!M9=\"\",NA(),IF($A$11=FALSE,NA(),Data!M9))","v":{"$error":"#N/A"}},{"$f":"IF(Data!N9=\"\",NA(),IF($A$11=FALSE,NA(),Data!N9))","v":{"$error":"#N/A"}},{"$f":"IF(Data!O9=\"\",NA(),IF($A$11=FALSE,NA(),Data!O9))","v":{"$error":"#N/A"}},{"$f":"IF(Data!P9=\"\",NA(),IF($A$11=FALSE,NA(),Data!P9))","v":{"$error":"#N/A"}},{"$f":"IF(Data!Q9=\"\",NA(),IF($A$11=FALSE,NA(),Data!Q9))","v":{"$error":"#N/A"}},{"$f":"IF(Data!R9=\"\",NA(),IF($A$11=FALSE,NA(),Data!R9))","v":{"$error":"#N/A"}},{"$f":"IF(Data!S9=\"\",NA(),IF($A$11=FALSE,NA(),Data!S9))","v":{"$error":"#N/A"}}]
[null,"Red",{"$f":"IF(Data!H$11=\"\",0,IF(AND($A$3=List!$A$14,Status!$Q$9=-1),Data!H$11,IF(AND($A$3=List!$A$15,Status!$R$9=-1),Data!H$11,0)))","v":0},{"$f":"IF(Data!I$11=\"\",NA(),IF(AND($A$3=List!$A$14,Status!$Q$9=-1),Data!I$11,IF(AND($A$3=List!$A$15,Status!$R$9=-1),Data!I$11,NA())))","v":{"$error":"#N/A"}},{"$f":"IF(Data!J$11=\"\",NA(),IF(AND($A$3=List!$A$14,Status!$Q$9=-1),Data!J$11,IF(AND($A$3=List!$A$15,Status!$R$9=-1),Data!J$11,NA())))","v":{"$error":"#N/A"}},{"$f":"IF(Data!K$11=\"\",NA(),IF(AND($A$3=List!$A$14,Status!$Q$9=-1),Data!K$11,IF(AND($A$3=List!$A$15,Status!$R$9=-1),Data!K$11,NA())))","v":{"$error":"#N/A"}},{"$f":"IF(Data!L$11=\"\",NA(),IF(AND($A$3=List!$A$14,Status!$Q$9=-1),Data!L$11,IF(AND($A$3=List!$A$15,Status!$R$9=-1),Data!L$11,NA())))","v":{"$error":"#N/A"}},{"$f":"IF(Data!M$11=\"\",NA(),IF(AND($A$3=List!$A$14,Status!$Q$9=-1),Data!M$11,IF(AND($A$3=List!$A$15,Status!$R$9=-1),Data!M$11,NA())))","v":{"$error":"#N/A"}},{"$f":"IF(Data!N$11=\"\",NA(),IF(AND($A$3=List!$A$14,Status!$Q$9=-1),Data!N$11,IF(AND($A$3=List!$A$15,Status!$R$9=-1),Data!N$11,NA())))","v":{"$error":"#N/A"}},{"$f":"IF(Data!O$11=\"\",NA(),IF(AND($A$3=List!$A$14,Status!$Q$9=-1),Data!O$11,IF(AND($A$3=List!$A$15,Status!$R$9=-1),Data!O$11,NA())))","v":{"$error":"#N/A"}},{"$f":"IF(Data!P$11=\"\",NA(),IF(AND($A$3=List!$A$14,Status!$Q$9=-1),Data!P$11,IF(AND($A$3=List!$A$15,Status!$R$9=-1),Data!P$11,NA())))","v":{"$error":"#N/A"}},{"$f":"IF(Data!Q$11=\"\",NA(),IF(AND($A$3=List!$A$14,Status!$Q$9=-1),Data!Q$11,IF(AND($A$3=List!$A$15,Status!$R$9=-1),Data!Q$11,NA())))","v":{"$error":"#N/A"}},{"$f":"IF(Data!R$11=\"\",NA(),IF(AND($A$3=List!$A$14,Status!$Q$9=-1),Data!R$11,IF(AND($A$3=List!$A$15,Status!$R$9=-1),Data!R$11,NA())))","v":{"$error":"#N/A"}},{"$f":"IF(Data!S$11=\"\",NA(),IF(AND($A$3=List!$A$14,Status!$Q$9=-1),Data!S$11,IF(AND($A$3=List!$A$15,Status!$R$9=-1),Data!S$11,NA())))","v":{"$error":"#N/A"}}]
[null,"Yellow",{"$f":"IF(Data!H$11=\"\",0,IF(AND($A$3=List!$A$14,Status!$Q$9=0),Data!H$11,IF(AND($A$3=List!$A$15,Status!$R$9=0),Data!H$11,0)))","v":0},{"$f":"IF(Data!I$11=\"\",NA(),IF(AND($A$3=List!$A$14,Status!$Q$9=0),Data!I$11,IF(AND($A$3=List!$A$15,Status!$R$9=0),Data!I$11,NA())))","v":{"$error":"#N/A"}},{"$f":"IF(Data!J$11=\"\",NA(),IF(AND($A$3=List!$A$14,Status!$Q$9=0),Data!J$11,IF(AND($A$3=List!$A$15,Status!$R$9=0),Data!J$11,NA())))","v":{"$error":"#N/A"}},{"$f":"IF(Data!K$11=\"\",NA(),IF(AND($A$3=List!$A$14,Status!$Q$9=0),Data!K$11,IF(AND($A$3=List!$A$15,Status!$R$9=0),Data!K$11,NA())))","v":{"$error":"#N/A"}},{"$f":"IF(Data!L$11=\"\",NA(),IF(AND($A$3=List!$A$14,Status!$Q$9=0),Data!L$11,IF(AND($A$3=List!$A$15,Status!$R$9=0),Data!L$11,NA())))","v":{"$error":"#N/A"}},{"$f":"IF(Data!M$11=\"\",NA(),IF(AND($A$3=List!$A$14,Status!$Q$9=0),Data!M$11,IF(AND($A$3=List!$A$15,Status!$R$9=0),Data!M$11,NA())))","v":{"$error":"#N/A"}},{"$f":"IF(Data!N$11=\"\",NA(),IF(AND($A$3=List!$A$14,Status!$Q$9=0),Data!N$11,IF(AND($A$3=List!$A$15,Status!$R$9=0),Data!N$11,NA())))","v":{"$error":"#N/A"}},{"$f":"IF(Data!O$11=\"\",NA(),IF(AND($A$3=List!$A$14,Status!$Q$9=0),Data!O$11,IF(AND($A$3=List!$A$15,Status!$R$9=0),Data!O$11,NA())))","v":{"$error":"#N/A"}},{"$f":"IF(Data!P$11=\"\",NA(),IF(AND($A$3=List!$A$14,Status!$Q$9=0),Data!P$11,IF(AND($A$3=List!$A$15,Status!$R$9=0),Data!P$11,NA())))","v":{"$error":"#N/A"}},{"$f":"IF(Data!Q$11=\"\",NA(),IF(AND($A$3=List!$A$14,Status!$Q$9=0),Data!Q$11,IF(AND($A$3=List!$A$15,Status!$R$9=0),Data!Q$11,NA())))","v":{"$error":"#N/A"}},{"$f":"IF(Data!R$11=\"\",NA(),IF(AND($A$3=List!$A$14,Status!$Q$9=0),Data!R$11,IF(AND($A$3=List!$A$15,Status!$R$9=0),Data!R$11,NA())))","v":{"$error":"#N/A"}},{"$f":"IF(Data!S$11=\"\",NA(),IF(AND($A$3=List!$A$14,Status!$Q$9=0),Data!S$11,IF(AND($A$3=List!$A$15,Status!$R$9=0),Data!S$11,NA())))","v":{"$error":"#N/A"}}]
[null,"Green",{"$f":"IF(Data!H$11=\"\",0,IF(AND($A$3=List!$A$14,Status!$Q$9=1),Data!H$11,IF(AND($A$3=List!$A$15,Status!$R$9=1),Data!H$11,0)))","v":0},{"$f":"IF(Data!I$11=\"\",NA(),IF(AND($A$3=List!$A$14,Status!$Q$9=1),Data!I$11,IF(AND($A$3=List!$A$15,Status!$R$9=1),Data!I$11,NA())))","v":{"$error":"#N/A"}},{"$f":"IF(Data!J$11=\"\",NA(),IF(AND($A$3=List!$A$14,Status!$Q$9=1),Data!J$11,IF(AND($A$3=List!$A$15,Status!$R$9=1),Data!J$11,NA())))","v":{"$error":"#N/A"}},{"$f":"IF(Data!K$11=\"\",NA(),IF(AND($A$3=List!$A$14,Status!$Q$9=1),Data!K$11,IF(AND($A$3=List!$A$15,Status!$R$9=1),Data!K$11,NA())))","v":{"$error":"#N/A"}},{"$f":"IF(Data!L$11=\"\",NA(),IF(AND($A$3=List!$A$14,Status!$Q$9=1),Data!L$11,IF(AND($A$3=List!$A$15,Status!$R$9=1),Data!L$11,NA())))","v":{"$error":"#N/A"}},{"$f":"IF(Data!M$11=\"\",NA(),IF(AND($A$3=List!$A$14,Status!$Q$9=1),Data!M$11,IF(AND($A$3=List!$A$15,Status!$R$9=1),Data!M$11,NA())))","v":{"$error":"#N/A"}},{"$f":"IF(Data!N$11=\"\",NA(),IF(AND($A$3=List!$A$14,Status!$Q$9=1),Data!N$11,IF(AND($A$3=List!$A$15,Status!$R$9=1),Data!N$11,NA())))","v":{"$error":"#N/A"}},{"$f":"IF(Data!O$11=\"\",NA(),IF(AND($A$3=List!$A$14,Status!$Q$9=1),Data!O$11,IF(AND($A$3=List!$A$15,Status!$R$9=1),Data!O$11,NA())))","v":{"$error":"#N/A"}},{"$f":"IF(Data!P$11=\"\",NA(),IF(AND($A$3=List!$A$14,Status!$Q$9=1),Data!P$11,IF(AND($A$3=List!$A$15,Status!$R$9=1),Data!P$11,NA())))","v":{"$error":"#N/A"}},{"$f":"IF(Data!Q$11=\"\",NA(),IF(AND($A$3=List!$A$14,Status!$Q$9=1),Data!Q$11,IF(AND($A$3=List!$A$15,Status!$R$9=1),Data!Q$11,NA())))","v":{"$error":"#N/A"}},{"$f":"IF(Data!R$11=\"\",NA(),IF(AND($A$3=List!$A$14,Status!$Q$9=1),Data!R$11,IF(AND($A$3=List!$A$15,Status!$R$9=1),Data!R$11,NA())))","v":{"$error":"#N/A"}},{"$f":"IF(Data!S$11=\"\",NA(),IF(AND($A$3=List!$A$14,Status!$Q$9=1),Data!S$11,IF(AND($A$3=List!$A$15,Status!$R$9=1),Data!S$11,NA())))","v":{"$error":"#N/A"}}]
[{"$f":"A11","v":false},{"$f":"B11","v":"Meta"},{"$f":"IF(Data!H12=\"\",0,IF($A$15=FALSE,0,Data!H12))","v":0},{"$f":"IF(Data!I12=\"\",NA(),IF($A$15=FALSE,NA(),Data!I12))","v":{"$error":"#N/A"}},{"$f":"IF(Data!J12=\"\",NA(),IF($A$15=FALSE,NA(),Data!J12))","v":{"$error":"#N/A"}},{"$f":"IF(Data!K12=\"\",NA(),IF($A$15=FALSE,NA(),Data!K12))","v":{"$error":"#N/A"}},{"$f":"IF(Data!L12=\"\",NA(),IF($A$15=FALSE,NA(),Data!L12))","v":{"$error":"#N/A"}},{"$f":"IF(Data!M12=\"\",NA(),IF($A$15=FALSE,NA(),Data!M12))","v":{"$error":"#N/A"}},{"$f":"IF(Data!N12=\"\",NA(),IF($A$15=FALSE,NA(),Data!N12))","v":{"$error":"#N/A"}},{"$f":"IF(Data!O12=\"\",NA(),IF($A$15=FALSE,NA(),Data!O12))","v":{"$error":"#N/A"}},{"$f":"IF(Data!P12=\"\",NA(),IF($A$15=FALSE,NA(),Data!P12))","v":{"$error":"#N/A"}},{"$f":"IF(Data!Q12=\"\",NA(),IF($A$15=FALSE,NA(),Data!Q12))","v":{"$error":"#N/A"}},{"$f":"IF(Data!R12=\"\",NA(),IF($A$15=FALSE,NA(),Data!R12))","v":{"$error":"#N/A"}},{"$f":"IF(Data!S12=\"\",NA(),IF($A$15=FALSE,NA(),Data!S12))","v":{"$error":"#N/A"}}]
[null,"Red",{"$f":"IF(Data!H$14=\"\",0,IF(AND($A$3=List!$A$14,Status!$Q$11=-1),Data!H$14,IF(AND($A$3=List!$A$15,Status!$R$11=-1),Data!H$14,0)))","v":0},{"$f":"IF(Data!I$14=\"\",NA(),IF(AND($A$3=List!$A$14,Status!$Q$11=-1),Data!I$14,IF(AND($A$3=List!$A$15,Status!$R$11=-1),Data!I$14,NA())))","v":{"$error":"#N/A"}},{"$f":"IF(Data!J$14=\"\",NA(),IF(AND($A$3=List!$A$14,Status!$Q$11=-1),Data!J$14,IF(AND($A$3=List!$A$15,Status!$R$11=-1),Data!J$14,NA())))","v":{"$error":"#N/A"}},{"$f":"IF(Data!K$14=\"\",NA(),IF(AND($A$3=List!$A$14,Status!$Q$11=-1),Data!K$14,IF(AND($A$3=List!$A$15,Status!$R$11=-1),Data!K$14,NA())))","v":{"$error":"#N/A"}},{"$f":"IF(Data!L$14=\"\",NA(),IF(AND($A$3=List!$A$14,Status!$Q$11=-1),Data!L$14,IF(AND($A$3=List!$A$15,Status!$R$11=-1),Data!L$14,NA())))","v":{"$error":"#N/A"}},{"$f":"IF(Data!M$14=\"\",NA(),IF(AND($A$3=List!$A$14,Status!$Q$11=-1),Data!M$14,IF(AND($A$3=List!$A$15,Status!$R$11=-1),Data!M$14,NA())))","v":{"$error":"#N/A"}},{"$f":"IF(Data!N$14=\"\",NA(),IF(AND($A$3=List!$A$14,Status!$Q$11=-1),Data!N$14,IF(AND($A$3=List!$A$15,Status!$R$11=-1),Data!N$14,NA())))","v":{"$error":"#N/A"}},{"$f":"IF(Data!O$14=\"\",NA(),IF(AND($A$3=List!$A$14,Status!$Q$11=-1),Data!O$14,IF(AND($A$3=List!$A$15,Status!$R$11=-1),Data!O$14,NA())))","v":{"$error":"#N/A"}},{"$f":"IF(Data!P$14=\"\",NA(),IF(AND($A$3=List!$A$14,Status!$Q$11=-1),Data!P$14,IF(AND($A$3=List!$A$15,Status!$R$11=-1),Data!P$14,NA())))","v":{"$error":"#N/A"}},{"$f":"IF(Data!Q$14=\"\",NA(),IF(AND($A$3=List!$A$14,Status!$Q$11=-1),Data!Q$14,IF(AND($A$3=List!$A$15,Status!$R$11=-1),Data!Q$14,NA())))","v":{"$error":"#N/A"}},{"$f":"IF(Data!R$14=\"\",NA(),IF(AND($A$3=List!$A$14,Status!$Q$11=-1),Data!R$14,IF(AND($A$3=List!$A$15,Status!$R$11=-1),Data!R$14,NA())))","v":{"$error":"#N/A"}},{"$f":"IF(Data!S$14=\"\",NA(),IF(AND($A$3=List!$A$14,Status!$Q$11=-1),Data!S$14,IF(AND($A$3=List!$A$15,Status!$R$11=-1),Data!S$14,NA())))","v":{"$error":"#N/A"}}]
[null,"Yellow",{"$f":"IF(Data!H$14=\"\",0,IF(AND($A$3=List!$A$14,Status!$Q$11=0),Data!H$14,IF(AND($A$3=List!$A$15,Status!$R$11=0),Data!H$14,0)))","v":1},{"$f":"IF(Data!I$14=\"\",NA(),IF(AND($A$3=List!$A$14,Status!$Q$11=0),Data!I$14,IF(AND($A$3=List!$A$15,Status!$R$11=0),Data!I$14,NA())))","v":2},{"$f":"IF(Data!J$14=\"\",NA(),IF(AND($A$3=List!$A$14,Status!$Q$11=0),Data!J$14,IF(AND($A$3=List!$A$15,Status!$R$11=0),Data!J$14,NA())))","v":1},{"$f":"IF(Data!K$14=\"\",NA(),IF(AND($A$3=List!$A$14,Status!$Q$11=0),Data!K$14,IF(AND($A$3=List!$A$15,Status!$R$11=0),Data!K$14,NA())))","v":{"$error":"#N/A"}},{"$f":"IF(Data!L$14=\"\",NA(),IF(AND($A$3=List!$A$14,Status!$Q$11=0),Data!L$14,IF(AND($A$3=List!$A$15,Status!$R$11=0),Data!L$14,NA())))","v":{"$error":"#N/A"}},{"$f":"IF(Data!M$14=\"\",NA(),IF(AND($A$3=List!$A$14,Status!$Q$11=0),Data!M$14,IF(AND($A$3=List!$A$15,Status!$R$11=0),Data!M$14,NA())))","v":{"$error":"#N/A"}},{"$f":"IF(Data!N$14=\"\",NA(),IF(AND($A$3=List!$A$14,Status!$Q$11=0),Data!N$14,IF(AND($A$3=List!$A$15,Status!$R$11=0),Data!N$14,NA())))","v":{"$error":"#N/A"}},{"$f":"IF(Data!O$14=\"\",NA(),IF(AND($A$3=List!$A$14,Status!$Q$11=0),Data!O$14,IF(AND($A$3=List!$A$15,Status!$R$11=0),Data!O$14,NA())))","v":{"$error":"#N/A"}},{"$f":"IF(Data!P$14=\"\",NA(),IF(AND($A$3=List!$A$14,Status!$Q$11=0),Data!P$14,IF(AND($A$3=List!$A$15,Status!$R$11=0),Data!P$14,NA())))","v":{"$error":"#N/A"}},{"$f":"IF(Data!Q$14=\"\",NA(),IF(AND($A$3=List!$A$14,Status!$Q$11=0),Data!Q$14,IF(AND($A$3=List!$A$15,Status!$R$11=0),Data!Q$14,NA())))","v":{"$error":"#N/A"}},{"$f":"IF(Data!R$14=\"\",NA(),IF(AND($A$3=List!$A$14,Status!$Q$11=0),Data!R$14,IF(AND($A$3=List!$A$15,Status!$R$11=0),Data!R$14,NA())))","v":{"$error":"#N/A"}},{"$f":"IF(Data!S$14=\"\",NA(),IF(AND($A$3=List!$A$14,Status!$Q$11=0),Data!S$14,IF(AND($A$3=List!$A$15,Status!$R$11=0),Data!S$14,NA())))","v":{"$error":"#N/A"}}]
[null,"Green",{"$f":"IF(Data!H$14=\"\",0,IF(AND($A$3=List!$A$14,Status!$Q$11=1),Data!H$14,IF(AND($A$3=List!$A$15,Status!$R$11=1),Data!H$14,0)))","v":0},{"$f":"IF(Data!I$14=\"\",NA(),IF(AND($A$3=List!$A$14,Status!$Q$11=1),Data!I$14,IF(AND($A$3=List!$A$15,Status!$R$11=1),Data!I$14,NA())))","v":{"$error":"#N/A"}},{"$f":"IF(Data!J$14=\"\",NA(),IF(AND($A$3=List!$A$14,Status!$Q$11=1),Data!J$14,IF(AND($A$3=List!$A$15,Status!$R$11=1),Data!J$14,NA())))","v":{"$error":"#N/A"}},{"$f":"IF(Data!K$14=\"\",NA(),IF(AND($A$3=List!$A$14,Status!$Q$11=1),Data!K$14,IF(AND($A$3=List!$A$15,Status!$R$11=1),Data!K$14,NA())))","v":{"$error":"#N/A"}},{"$f":"IF(Data!L$14=\"\",NA(),IF(AND($A$3=List!$A$14,Status!$Q$11=1),Data!L$14,IF(AND($A$3=List!$A$15,Status!$R$11=1),Data!L$14,NA())))","v":{"$error":"#N/A"}},{"$f":"IF(Data!M$14=\"\",NA(),IF(AND($A$3=List!$A$14,Status!$Q$11=1),Data!M$14,IF(AND($A$3=List!$A$15,Status!$R$11=1),Data!M$14,NA())))","v":{"$error":"#N/A"}},{"$f":"IF(Data!N$14=\"\",NA(),IF(AND($A$3=List!$A$14,Status!$Q$11=1),Data!N$14,IF(AND($A$3=List!$A$15,Status!$R$11=1),Data!N$14,NA())))","v":{"$error":"#N/A"}},{"$f":"IF(Data!O$14=\"\",NA(),IF(AND($A$3=List!$A$14,Status!$Q$11=1),Data!O$14,IF(AND($A$3=List!$A$15,Status!$R$11=1),Data!O$14,NA())))","v":{"$error":"#N/A"}},{"$f":"IF(Data!P$14=\"\",NA(),IF(AND($A$3=List!$A$14,Status!$Q$11=1),Data!P$14,IF(AND($A$3=List!$A$15,Status!$R$11=1),Data!P$14,NA())))","v":{"$error":"#N/A"}},{"$f":"IF(Data!Q$14=\"\",NA(),IF(AND($A$3=List!$A$14,Status!$Q$11=1),Data!Q$14,IF(AND($A$3=List!$A$15,Status!$R$11=1),Data!Q$14,NA())))","v":{"$error":"#N/A"}},{"$f":"IF(Data!R$14=\"\",NA(),IF(AND($A$3=List!$A$14,Status!$Q$11=1),Data!R$14,IF(AND($A$3=List!$A$15,Status!$R$11=1),Data!R$14,NA())))","v":{"$error":"#N/A"}},{"$f":"IF(Data!S$14=\"\",NA(),IF(AND($A$3=List!$A$14,Status!$Q$11=1),Data!S$14,IF(AND($A$3=List!$A$15,Status!$R$11=1),Data!S$14,NA())))","v":{"$error":"#N/A"}}]
[{"$f":"A15","v":false},{"$f":"B15","v":"Meta"},{"$f":"IF(Data!H15=\"\",0,IF($A$19=FALSE,0,Data!H15))","v":0},{"$f":"IF(Data!I15=\"\",NA(),IF($A$19=FALSE,NA(),Data!I15))","v":{"$error":"#N/A"}},{"$f":"IF(Data!J15=\"\",NA(),IF($A$19=FALSE,NA(),Data!J15))","v":{"$error":"#N/A"}},{"$f":"IF(Data!K15=\"\",NA(),IF($A$19=FALSE,NA(),Data!K15))","v":{"$error":"#N/A"}},{"$f":"IF(Data!L15=\"\",NA(),IF($A$19=FALSE,NA(),Data!L15))","v":{"$error":"#N/A"}},{"$f":"IF(Data!M15=\"\",NA(),IF($A$19=FALSE,NA(),Data!M15))","v":{"$error":"#N/A"}},{"$f":"IF(Data!N15=\"\",NA(),IF($A$19=FALSE,NA(),Data!N15))","v":{"$error":"#N/A"}},{"$f":"IF(Data!O15=\"\",NA(),IF($A$19=FALSE,NA(),Data!O15))","v":{"$error":"#N/A"}},{"$f":"IF(Data!P15=\"\",NA(),IF($A$19=FALSE,NA(),Data!P15))","v":{"$error":"#N/A"}},{"$f":"IF(Data!Q15=\"\",NA(),IF($A$19=FALSE,NA(),Data!Q15))","v":{"$error":"#N/A"}},{"$f":"IF(Data!R15=\"\",NA(),IF($A$19=FALSE,NA(),Data!R15))","v":{"$error":"#N/A"}},{"$f":"IF(Data!S15=\"\",NA(),IF($A$19=FALSE,NA(),Data!S15))","v":{"$error":"#N/A"}}]
[null,"Red",{"$f":"IF(Data!H$17=\"\",0,IF(AND($A$3=List!$A$14,Status!$Q$13=-1),Data!H$17,IF(AND($A$3=List!$A$15,Status!$R$13=-1),Data!H$17,0)))","v":0},{"$f":"IF(Data!I$17=\"\",NA(),IF(AND($A$3=List!$A$14,Status!$Q$13=-1),Data!I$17,IF(AND($A$3=List!$A$15,Status!$R$13=-1),Data!I$17,NA())))","v":{"$error":"#N/A"}},{"$f":"IF(Data!J$17=\"\",NA(),IF(AND($A$3=List!$A$14,Status!$Q$13=-1),Data!J$17,IF(AND($A$3=List!$A$15,Status!$R$13=-1),Data!J$17,NA())))","v":{"$error":"#N/A"}},{"$f":"IF(Data!K$17=\"\",NA(),IF(AND($A$3=List!$A$14,Status!$Q$13=-1),Data!K$17,IF(AND($A$3=List!$A$15,Status!$R$13=-1),Data!K$17,NA())))","v":{"$error":"#N/A"}},{"$f":"IF(Data!L$17=\"\",NA(),IF(AND($A$3=List!$A$14,Status!$Q$13=-1),Data!L$17,IF(AND($A$3=List!$A$15,Status!$R$13=-1),Data!L$17,NA())))","v":{"$error":"#N/A"}},{"$f":"IF(Data!M$17=\"\",NA(),IF(AND($A$3=List!$A$14,Status!$Q$13=-1),Data!M$17,IF(AND($A$3=List!$A$15,Status!$R$13=-1),Data!M$17,NA())))","v":{"$error":"#N/A"}},{"$f":"IF(Data!N$17=\"\",NA(),IF(AND($A$3=List!$A$14,Status!$Q$13=-1),Data!N$17,IF(AND($A$3=List!$A$15,Status!$R$13=-1),Data!N$17,NA())))","v":{"$error":"#N/A"}},{"$f":"IF(Data!O$17=\"\",NA(),IF(AND($A$3=List!$A$14,Status!$Q$13=-1),Data!O$17,IF(AND($A$3=List!$A$15,Status!$R$13=-1),Data!O$17,NA())))","v":{"$error":"#N/A"}},{"$f":"IF(Data!P$17=\"\",NA(),IF(AND($A$3=List!$A$14,Status!$Q$13=-1),Data!P$17,IF(AND($A$3=List!$A$15,Status!$R$13=-1),Data!P$17,NA())))","v":{"$error":"#N/A"}},{"$f":"IF(Data!Q$17=\"\",NA(),IF(AND($A$3=List!$A$14,Status!$Q$13=-1),Data!Q$17,IF(AND($A$3=List!$A$15,Status!$R$13=-1),Data!Q$17,NA())))","v":{"$error":"#N/A"}},{"$f":"IF(Data!R$17=\"\",NA(),IF(AND($A$3=List!$A$14,Status!$Q$13=-1),Data!R$17,IF(AND($A$3=List!$A$15,Status!$R$13=-1),Data!R$17,NA())))","v":{"$error":"#N/A"}},{"$f":"IF(Data!S$17=\"\",NA(),IF(AND($A$3=List!$A$14,Status!$Q$13=-1),Data!S$17,IF(AND($A$3=List!$A$15,Status!$R$13=-1),Data!S$17,NA())))","v":{"$error":"#N/A"}}]
[null,"Yellow",{"$f":"IF(Data!H$17=\"\",0,IF(AND($A$3=List!$A$14,Status!$Q$13=0),Data!H$17,IF(AND($A$3=List!$A$15,Status!$R$13=0),Data!H$17,0)))","v":0},{"$f":"IF(Data!I$17=\"\",NA(),IF(AND($A$3=List!$A$14,Status!$Q$13=0),Data!I$17,IF(AND($A$3=List!$A$15,Status!$R$13=0),Data!I$17,NA())))","v":{"$error":"#N/A"}},{"$f":"IF(Data!J$17=\"\",NA(),IF(AND($A$3=List!$A$14,Status!$Q$13=0),Data!J$17,IF(AND($A$3=List!$A$15,Status!$R$13=0),Data!J$17,NA())))","v":{"$error":"#N/A"}},{"$f":"IF(Data!K$17=\"\",NA(),IF(AND($A$3=List!$A$14,Status!$Q$13=0),Data!K$17,IF(AND($A$3=List!$A$15,Status!$R$13=0),Data!K$17,NA())))","v":{"$error":"#N/A"}},{"$f":"IF(Data!L$17=\"\",NA(),IF(AND($A$3=List!$A$14,Status!$Q$13=0),Data!L$17,IF(AND($A$3=List!$A$15,Status!$R$13=0),Data!L$17,NA())))","v":{"$error":"#N/A"}},{"$f":"IF(Data!M$17=\"\",NA(),IF(AND($A$3=List!$A$14,Status!$Q$13=0),Data!M$17,IF(AND($A$3=List!$A$15,Status!$R$13=0),Data!M$17,NA())))","v":{"$error":"#N/A"}},{"$f":"IF(Data!N$17=\"\",NA(),IF(AND($A$3=List!$A$14,Status!$Q$13=0),Data!N$17,IF(AND($A$3=List!$A$15,Status!$R$13=0),Data!N$17,NA())))","v":{"$error":"#N/A"}},{"$f":"IF(Data!O$17=\"\",NA(),IF(AND($A$3=List!$A$14,Status!$Q$13=0),Data!O$17,IF(AND($A$3=List!$A$15,Status!$R$13=0),Data!O$17,NA())))","v":{"$error":"#N/A"}},{"$f":"IF(Data!P$17=\"\",NA(),IF(AND($A$3=List!$A$14,Status!$Q$13=0),Data!P$17,IF(AND($A$3=List!$A$15,Status!$R$13=0),Data!P$17,NA())))","v":{"$error":"#N/A"}},{"$f":"IF(Data!Q$17=\"\",NA(),IF(AND($A$3=List!$A$14,Status!$Q$13=0),Data!Q$17,IF(AND($A$3=List!$A$15,Status!$R$13=0),Data!Q$17,NA())))","v":{"$error":"#N/A"}},{"$f":"IF(Data!R$17=\"\",NA(),IF(AND($A$3=List!$A$14,Status!$Q$13=0),Data!R$17,IF(AND($A$3=List!$A$15,Status!$R$13=0),Data!R$17,NA())))","v":{"$error":"#N/A"}},{"$f":"IF(Data!S$17=\"\",NA(),IF(AND($A$3=List!$A$14,Status!$Q$13=0),Data!S$17,IF(AND($A$3=List!$A$15,Status!$R$13=0),Data!S$17,NA())))","v":{"$error":"#N/A"}}]
[null,"Green",{"$f":"IF(Data!H$17=\"\",0,IF(AND($A$3=List!$A$14,Status!$Q$13=1),Data!H$17,IF(AND($A$3=List!$A$15,Status!$R$13=1),Data!H$17,0)))","v":0},{"$f":"IF(Data!I$17=\"\",NA(),IF(AND($A$3=List!$A$14,Status!$Q$13=1),Data!I$17,IF(AND($A$3=List!$A$15,Status!$R$13=1),Data!I$17,NA())))","v":{"$error":"#N/A"}},{"$f":"IF(Data!J$17=\"\",NA(),IF(AND($A$3=List!$A$14,Status!$Q$13=1),Data!J$17,IF(AND($A$3=List!$A$15,Status!$R$13=1),Data!J$17,NA())))","v":{"$error":"#N/A"}},{"$f":"IF(Data!K$17=\"\",NA(),IF(AND($A$3=List!$A$14,Status!$Q$13=1),Data!K$17,IF(AND($A$3=List!$A$15,Status!$R$13=1),Data!K$17,NA())))","v":{"$error":"#N/A"}},{"$f":"IF(Data!L$17=\"\",NA(),IF(AND($A$3=List!$A$14,Status!$Q$13=1),Data!L$17,IF(AND($A$3=List!$A$15,Status!$R$13=1),Data!L$17,NA())))","v":{"$error":"#N/A"}},{"$f":"IF(Data!M$17=\"\",NA(),IF(AND($A$3=List!$A$14,Status!$Q$13=1),Data!M$17,IF(AND($A$3=List!$A$15,Status!$R$13=1),Data!M$17,NA())))","v":{"$error":"#N/A"}},{"$f":"IF(Data!N$17=\"\",NA(),IF(AND($A$3=List!$A$14,Status!$Q$13=1),Data!N$17,IF(AND($A$3=List!$A$15,Status!$R$13=1),Data!N$17,NA())))","v":{"$error":"#N/A"}},{"$f":"IF(Data!O$17=\"\",NA(),IF(AND($A$3=List!$A$14,Status!$Q$13=1),Data!O$17,IF(AND($A$3=List!$A$15,Status!$R$13=1),Data!O$17,NA())))","v":{"$error":"#N/A"}},{"$f":"IF(Data!P$17=\"\",NA(),IF(AND($A$3=List!$A$14,Status!$Q$13=1),Data!P$17,IF(AND($A$3=List!$A$15,Status!$R$13=1),Data!P$17,NA())))","v":{"$error":"#N/A"}},{"$f":"IF(Data!Q$17=\"\",NA(),IF(AND($A$3=List!$A$14,Status!$Q$13=1),Data!Q$17,IF(AND($A$3=List!$A$15,Status!$R$13=1),Data!Q$17,NA())))","v":{"$error":"#N/A"}},{"$f":"IF(Data!R$17=\"\",NA(),IF(AND($A$3=List!$A$14,Status!$Q$13=1),Data!R$17,IF(AND($A$3=List!$A$15,Status!$R$13=1),Data!R$17,NA())))","v":{"$error":"#N/A"}},{"$f":"IF(Data!S$17=\"\",NA(),IF(AND($A$3=List!$A$14,Status!$Q$13=1),Data!S$17,IF(AND($A$3=List!$A$15,Status!$R$13=1),Data!S$17,NA())))","v":{"$error":"#N/A"}}]
[{"$f":"A19","v":false},{"$f":"B19","v":"Meta"},{"$f":"IF(Data!H18=\"\",0,IF($A$23=FALSE,0,Data!H18))","v":0},{"$f":"IF(Data!I18=\"\",NA(),IF($A$23=FALSE,NA(),Data!I18))","v":{"$error":"#N/A"}},{"$f":"IF(Data!J18=\"\",NA(),IF($A$23=FALSE,NA(),Data!J18))","v":{"$error":"#N/A"}},{"$f":"IF(Data!K18=\"\",NA(),IF($A$23=FALSE,NA(),Data!K18))","v":{"$error":"#N/A"}},{"$f":"IF(Data!L18=\"\",NA(),IF($A$23=FALSE,NA(),Data!L18))","v":{"$error":"#N/A"}},{"$f":"IF(Data!M18=\"\",NA(),IF($A$23=FALSE,NA(),Data!M18))","v":{"$error":"#N/A"}},{"$f":"IF(Data!N18=\"\",NA(),IF($A$23=FALSE,NA(),Data!N18))","v":{"$error":"#N/A"}},{"$f":"IF(Data!O18=\"\",NA(),IF($A$23=FALSE,NA(),Data!O18))","v":{"$error":"#N/A"}},{"$f":"IF(Data!P18=\"\",NA(),IF($A$23=FALSE,NA(),Data!P18))","v":{"$error":"#N/A"}},{"$f":"IF(Data!Q18=\"\",NA(),IF($A$23=FALSE,NA(),Data!Q18))","v":{"$error":"#N/A"}},{"$f":"IF(Data!R18=\"\",NA(),IF($A$23=FALSE,NA(),Data!R18))","v":{"$error":"#N/A"}},{"$f":"IF(Data!S18=\"\",NA(),IF($A$23=FALSE,NA(),Data!S18))","v":{"$error":"#N/A"}}]
[null,"Red",{"$f":"IF(Data!H$20=\"\",0,IF(AND($A$3=List!$A$14,Status!$Q$15=-1),Data!H$20,IF(AND($A$3=List!$A$15,Status!$R$15=-1),Data!H$20,0)))","v":0},{"$f":"IF(Data!I$20=\"\",NA(),IF(AND($A$3=List!$A$14,Status!$Q$15=-1),Data!I$20,IF(AND($A$3=List!$A$15,Status!$R$15=-1),Data!I$20,NA())))","v":{"$error":"#N/A"}},{"$f":"IF(Data!J$20=\"\",NA(),IF(AND($A$3=List!$A$14,Status!$Q$15=-1),Data!J$20,IF(AND($A$3=List!$A$15,Status!$R$15=-1),Data!J$20,NA())))","v":{"$error":"#N/A"}},{"$f":"IF(Data!K$20=\"\",NA(),IF(AND($A$3=List!$A$14,Status!$Q$15=-1),Data!K$20,IF(AND($A$3=List!$A$15,Status!$R$15=-1),Data!K$20,NA())))","v":{"$error":"#N/A"}},{"$f":"IF(Data!L$20=\"\",NA(),IF(AND($A$3=List!$A$14,Status!$Q$15=-1),Data!L$20,IF(AND($A$3=List!$A$15,Status!$R$15=-1),Data!L$20,NA())))","v":{"$error":"#N/A"}},{"$f":"IF(Data!M$20=\"\",NA(),IF(AND($A$3=List!$A$14,Status!$Q$15=-1),Data!M$20,IF(AND($A$3=List!$A$15,Status!$R$15=-1),Data!M$20,NA())))","v":{"$error":"#N/A"}},{"$f":"IF(Data!N$20=\"\",NA(),IF(AND($A$3=List!$A$14,Status!$Q$15=-1),Data!N$20,IF(AND($A$3=List!$A$15,Status!$R$15=-1),Data!N$20,NA())))","v":{"$error":"#N/A"}},{"$f":"IF(Data!O$20=\"\",NA(),IF(AND($A$3=List!$A$14,Status!$Q$15=-1),Data!O$20,IF(AND($A$3=List!$A$15,Status!$R$15=-1),Data!O$20,NA())))","v":{"$error":"#N/A"}},{"$f":"IF(Data!P$20=\"\",NA(),IF(AND($A$3=List!$A$14,Status!$Q$15=-1),Data!P$20,IF(AND($A$3=List!$A$15,Status!$R$15=-1),Data!P$20,NA())))","v":{"$error":"#N/A"}},{"$f":"IF(Data!Q$20=\"\",NA(),IF(AND($A$3=List!$A$14,Status!$Q$15=-1),Data!Q$20,IF(AND($A$3=List!$A$15,Status!$R$15=-1),Data!Q$20,NA())))","v":{"$error":"#N/A"}},{"$f":"IF(Data!R$20=\"\",NA(),IF(AND($A$3=List!$A$14,Status!$Q$15=-1),Data!R$20,IF(AND($A$3=List!$A$15,Status!$R$15=-1),Data!R$20,NA())))","v":{"$error":"#N/A"}},{"$f":"IF(Data!S$20=\"\",NA(),IF(AND($A$3=List!$A$14,Status!$Q$15=-1),Data!S$20,IF(AND($A$3=List!$A$15,Status!$R$15=-1),Data!S$20,NA())))","v":{"$error":"#N/A"}}]
[null,"Yellow",{"$f":"IF(Data!H$20=\"\",0,IF(AND($A$3=List!$A$14,Status!$Q$15=0),Data!H$20,IF(AND($A$3=List!$A$15,Status!$R$15=0),Data!H$20,0)))","v":0},{"$f":"IF(Data!I$20=\"\",NA(),IF(AND($A$3=List!$A$14,Status!$Q$15=0),Data!I$20,IF(AND($A$3=List!$A$15,Status!$R$15=0),Data!I$20,NA())))","v":{"$error":"#N/A"}},{"$f":"IF(Data!J$20=\"\",NA(),IF(AND($A$3=List!$A$14,Status!$Q$15=0),Data!J$20,IF(AND($A$3=List!$A$15,Status!$R$15=0),Data!J$20,NA())))","v":{"$error":"#N/A"}},{"$f":"IF(Data!K$20=\"\",NA(),IF(AND($A$3=List!$A$14,Status!$Q$15=0),Data!K$20,IF(AND($A$3=List!$A$15,Status!$R$15=0),Data!K$20,NA())))","v":{"$error":"#N/A"}},{"$f":"IF(Data!L$20=\"\",NA(),IF(AND($A$3=List!$A$14,Status!$Q$15=0),Data!L$20,IF(AND($A$3=List!$A$15,Status!$R$15=0),Data!L$20,NA())))","v":{"$error":"#N/A"}},{"$f":"IF(Data!M$20=\"\",NA(),IF(AND($A$3=List!$A$14,Status!$Q$15=0),Data!M$20,IF(AND($A$3=List!$A$15,Status!$R$15=0),Data!M$20,NA())))","v":{"$error":"#N/A"}},{"$f":"IF(Data!N$20=\"\",NA(),IF(AND($A$3=List!$A$14,Status!$Q$15=0),Data!N$20,IF(AND($A$3=List!$A$15,Status!$R$15=0),Data!N$20,NA())))","v":{"$error":"#N/A"}},{"$f":"IF(Data!O$20=\"\",NA(),IF(AND($A$3=List!$A$14,Status!$Q$15=0),Data!O$20,IF(AND($A$3=List!$A$15,Status!$R$15=0),Data!O$20,NA())))","v":{"$error":"#N/A"}},{"$f":"IF(Data!P$20=\"\",NA(),IF(AND($A$3=List!$A$14,Status!$Q$15=0),Data!P$20,IF(AND($A$3=List!$A$15,Status!$R$15=0),Data!P$20,NA())))","v":{"$error":"#N/A"}},{"$f":"IF(Data!Q$20=\"\",NA(),IF(AND($A$3=List!$A$14,Status!$Q$15=0),Data!Q$20,IF(AND($A$3=List!$A$15,Status!$R$15=0),Data!Q$20,NA())))","v":{"$error":"#N/A"}},{"$f":"IF(Data!R$20=\"\",NA(),IF(AND($A$3=List!$A$14,Status!$Q$15=0),Data!R$20,IF(AND($A$3=List!$A$15,Status!$R$15=0),Data!R$20,NA())))","v":{"$error":"#N/A"}},{"$f":"IF(Data!S$20=\"\",NA(),IF(AND($A$3=List!$A$14,Status!$Q$15=0),Data!S$20,IF(AND($A$3=List!$A$15,Status!$R$15=0),Data!S$20,NA())))","v":{"$error":"#N/A"}}]
[null,"Green",{"$f":"IF(Data!H$20=\"\",0,IF(AND($A$3=List!$A$14,Status!$Q$15=1),Data!H$20,IF(AND($A$3=List!$A$15,Status!$R$15=1),Data!H$20,0)))","v":0},{"$f":"IF(Data!I$20=\"\",NA(),IF(AND($A$3=List!$A$14,Status!$Q$15=1),Data!I$20,IF(AND($A$3=List!$A$15,Status!$R$15=1),Data!I$20,NA())))","v":{"$error":"#N/A"}},{"$f":"IF(Data!J$20=\"\",NA(),IF(AND($A$3=List!$A$14,Status!$Q$15=1),Data!J$20,IF(AND($A$3=List!$A$15,Status!$R$15=1),Data!J$20,NA())))","v":{"$error":"#N/A"}},{"$f":"IF(Data!K$20=\"\",NA(),IF(AND($A$3=List!$A$14,Status!$Q$15=1),Data!K$20,IF(AND($A$3=List!$A$15,Status!$R$15=1),Data!K$20,NA())))","v":{"$error":"#N/A"}},{"$f":"IF(Data!L$20=\"\",NA(),IF(AND($A$3=List!$A$14,Status!$Q$15=1),Data!L$20,IF(AND($A$3=List!$A$15,Status!$R$15=1),Data!L$20,NA())))","v":{"$error":"#N/A"}},{"$f":"IF(Data!M$20=\"\",NA(),IF(AND($A$3=List!$A$14,Status!$Q$15=1),Data!M$20,IF(AND($A$3=List!$A$15,Status!$R$15=1),Data!M$20,NA())))","v":{"$error":"#N/A"}},{"$f":"IF(Data!N$20=\"\",NA(),IF(AND($A$3=List!$A$14,Status!$Q$15=1),Data!N$20,IF(AND($A$3=List!$A$15,Status!$R$15=1),Data!N$20,NA())))","v":{"$error":"#N/A"}},{"$f":"IF(Data!O$20=\"\",NA(),IF(AND($A$3=List!$A$14,Status!$Q$15=1),Data!O$20,IF(AND($A$3=List!$A$15,Status!$R$15=1),Data!O$20,NA())))","v":{"$error":"#N/A"}},{"$f":"IF(Data!P$20=\"\",NA(),IF(AND($A$3=List!$A$14,Status!$Q$15=1),Data!P$20,IF(AND($A$3=List!$A$15,Status!$R$15=1),Data!P$20,NA())))","v":{"$error":"#N/A"}},{"$f":"IF(Data!Q$20=\"\",NA(),IF(AND($A$3=List!$A$14,Status!$Q$15=1),Data!Q$20,IF(AND($A$3=List!$A$15,Status!$R$15=1),Data!Q$20,NA())))","v":{"$error":"#N/A"}},{"$f":"IF(Data!R$20=\"\",NA(),IF(AND($A$3=List!$A$14,Status!$Q$15=1),Data!R$20,IF(AND($A$3=List!$A$15,Status!$R$15=1),Data!R$20,NA())))","v":{"$error":"#N/A"}},{"$f":"IF(Data!S$20=\"\",NA(),IF(AND($A$3=List!$A$14,Status!$Q$15=1),Data!S$20,IF(AND($A$3=List!$A$15,Status!$R$15=1),Data!S$20,NA())))","v":{"$error":"#N/A"}}]
[{"$f":"A23","v":false},{"$f":"B23","v":"Meta"},{"$f":"IF(Data!H21=\"\",0,IF($A$27=FALSE,0,Data!H21))","v":0},{"$f":"IF(Data!I21=\"\",NA(),IF($A$27=FALSE,NA(),Data!I21))","v":{"$error":"#N/A"}},{"$f":"IF(Data!J21=\"\",NA(),IF($A$27=FALSE,NA(),Data!J21))","v":{"$error":"#N/A"}},{"$f":"IF(Data!K21=\"\",NA(),IF($A$27=FALSE,NA(),Data!K21))","v":{"$error":"#N/A"}},{"$f":"IF(Data!L21=\"\",NA(),IF($A$27=FALSE,NA(),Data!L21))","v":{"$error":"#N/A"}},{"$f":"IF(Data!M21=\"\",NA(),IF($A$27=FALSE,NA(),Data!M21))","v":{"$error":"#N/A"}},{"$f":"IF(Data!N21=\"\",NA(),IF($A$27=FALSE,NA(),Data!N21))","v":{"$error":"#N/A"}},{"$f":"IF(Data!O21=\"\",NA(),IF($A$27=FALSE,NA(),Data!O21))","v":{"$error":"#N/A"}},{"$f":"IF(Data!P21=\"\",NA(),IF($A$27=FALSE,NA(),Data!P21))","v":{"$error":"#N/A"}},{"$f":"IF(Data!Q21=\"\",NA(),IF($A$27=FALSE,NA(),Data!Q21))","v":{"$error":"#N/A"}},{"$f":"IF(Data!R21=\"\",NA(),IF($A$27=FALSE,NA(),Data!R21))","v":{"$error":"#N/A"}},{"$f":"IF(Data!S21=\"\",NA(),IF($A$27=FALSE,NA(),Data!S21))","v":{"$error":"#N/A"}}]
[null,"Red",{"$f":"IF(Data!H$23=\"\",0,IF(AND($A$3=List!$A$14,Status!$Q$17=-1),Data!H$23,IF(AND($A$3=List!$A$15,Status!$R$17=-1),Data!H$23,0)))","v":0},{"$f":"IF(Data!I$23=\"\",NA(),IF(AND($A$3=List!$A$14,Status!$Q$17=-1),Data!I$23,IF(AND($A$3=List!$A$15,Status!$R$17=-1),Data!I$23,NA())))","v":{"$error":"#N/A"}},{"$f":"IF(Data!J$23=\"\",NA(),IF(AND($A$3=List!$A$14,Status!$Q$17=-1),Data!J$23,IF(AND($A$3=List!$A$15,Status!$R$17=-1),Data!J$23,NA())))","v":{"$error":"#N/A"}},{"$f":"IF(Data!K$23=\"\",NA(),IF(AND($A$3=List!$A$14,Status!$Q$17=-1),Data!K$23,IF(AND($A$3=List!$A$15,Status!$R$17=-1),Data!K$23,NA())))","v":{"$error":"#N/A"}},{"$f":"IF(Data!L$23=\"\",NA(),IF(AND($A$3=List!$A$14,Status!$Q$17=-1),Data!L$23,IF(AND($A$3=List!$A$15,Status!$R$17=-1),Data!L$23,NA())))","v":{"$error":"#N/A"}},{"$f":"IF(Data!M$23=\"\",NA(),IF(AND($A$3=List!$A$14,Status!$Q$17=-1),Data!M$23,IF(AND($A$3=List!$A$15,Status!$R$17=-1),Data!M$23,NA())))","v":{"$error":"#N/A"}},{"$f":"IF(Data!N$23=\"\",NA(),IF(AND($A$3=List!$A$14,Status!$Q$17=-1),Data!N$23,IF(AND($A$3=List!$A$15,Status!$R$17=-1),Data!N$23,NA())))","v":{"$error":"#N/A"}},{"$f":"IF(Data!O$23=\"\",NA(),IF(AND($A$3=List!$A$14,Status!$Q$17=-1),Data!O$23,IF(AND($A$3=List!$A$15,Status!$R$17=-1),Data!O$23,NA())))","v":{"$error":"#N/A"}},{"$f":"IF(Data!P$23=\"\",NA(),IF(AND($A$3=List!$A$14,Status!$Q$17=-1),Data!P$23,IF(AND($A$3=List!$A$15,Status!$R$17=-1),Data!P$23,NA())))","v":{"$error":"#N/A"}},{"$f":"IF(Data!Q$23=\"\",NA(),IF(AND($A$3=List!$A$14,Status!$Q$17=-1),Data!Q$23,IF(AND($A$3=List!$A$15,Status!$R$17=-1),Data!Q$23,NA())))","v":{"$error":"#N/A"}},{"$f":"IF(Data!R$23=\"\",NA(),IF(AND($A$3=List!$A$14,Status!$Q$17=-1),Data!R$23,IF(AND($A$3=List!$A$15,Status!$R$17=-1),Data!R$23,NA())))","v":{"$error":"#N/A"}},{"$f":"IF(Data!S$23=\"\",NA(),IF(AND($A$3=List!$A$14,Status!$Q$17=-1),Data!S$23,IF(AND($A$3=List!$A$15,Status!$R$17=-1),Data!S$23,NA())))","v":{"$error":"#N/A"}}]
[null,"Yellow",{"$f":"IF(Data!H$23=\"\",0,IF(AND($A$3=List!$A$14,Status!$Q$17=0),Data!H$23,IF(AND($A$3=List!$A$15,Status!$R$17=0),Data!H$23,0)))","v":0},{"$f":"IF(Data!I$23=\"\",NA(),IF(AND($A$3=List!$A$14,Status!$Q$17=0),Data!I$23,IF(AND($A$3=List!$A$15,Status!$R$17=0),Data!I$23,NA())))","v":{"$error":"#N/A"}},{"$f":"IF(Data!J$23=\"\",NA(),IF(AND($A$3=List!$A$14,Status!$Q$17=0),Data!J$23,IF(AND($A$3=List!$A$15,Status!$R$17=0),Data!J$23,NA())))","v":{"$error":"#N/A"}},{"$f":"IF(Data!K$23=\"\",NA(),IF(AND($A$3=List!$A$14,Status!$Q$17=0),Data!K$23,IF(AND($A$3=List!$A$15,Status!$R$17=0),Data!K$23,NA())))","v":{"$error":"#N/A"}},{"$f":"IF(Data!L$23=\"\",NA(),IF(AND($A$3=List!$A$14,Status!$Q$17=0),Data!L$23,IF(AND($A$3=List!$A$15,Status!$R$17=0),Data!L$23,NA())))","v":{"$error":"#N/A"}},{"$f":"IF(Data!M$23=\"\",NA(),IF(AND($A$3=List!$A$14,Status!$Q$17=0),Data!M$23,IF(AND($A$3=List!$A$15,Status!$R$17=0),Data!M$23,NA())))","v":{"$error":"#N/A"}},{"$f":"IF(Data!N$23=\"\",NA(),IF(AND($A$3=List!$A$14,Status!$Q$17=0),Data!N$23,IF(AND($A$3=List!$A$15,Status!$R$17=0),Data!N$23,NA())))","v":{"$error":"#N/A"}},{"$f":"IF(Data!O$23=\"\",NA(),IF(AND($A$3=List!$A$14,Status!$Q$17=0),Data!O$23,IF(AND($A$3=List!$A$15,Status!$R$17=0),Data!O$23,NA())))","v":{"$error":"#N/A"}},{"$f":"IF(Data!P$23=\"\",NA(),IF(AND($A$3=List!$A$14,Status!$Q$17=0),Data!P$23,IF(AND($A$3=List!$A$15,Status!$R$17=0),Data!P$23,NA())))","v":{"$error":"#N/A"}},{"$f":"IF(Data!Q$23=\"\",NA(),IF(AND($A$3=List!$A$14,Status!$Q$17=0),Data!Q$23,IF(AND($A$3=List!$A$15,Status!$R$17=0),Data!Q$23,NA())))","v":{"$error":"#N/A"}},{"$f":"IF(Data!R$23=\"\",NA(),IF(AND($A$3=List!$A$14,Status!$Q$17=0),Data!R$23,IF(AND($A$3=List!$A$15,Status!$R$17=0),Data!R$23,NA())))","v":{"$error":"#N/A"}},{"$f":"IF(Data!S$23=\"\",NA(),IF(AND($A$3=List!$A$14,Status!$Q$17=0),Data!S$23,IF(AND($A$3=List!$A$15,Status!$R$17=0),Data!S$23,NA())))","v":{"$error":"#N/A"}}]
[null,"Green",{"$f":"IF(Data!H$23=\"\",0,IF(AND($A$3=List!$A$14,Status!$Q$17=1),Data!H$23,IF(AND($A$3=List!$A$15,Status!$R$17=1),Data!H$23,0)))","v":0},{"$f":"IF(Data!I$23=\"\",NA(),IF(AND($A$3=List!$A$14,Status!$Q$17=1),Data!I$23,IF(AND($A$3=List!$A$15,Status!$R$17=1),Data!I$23,NA())))","v":{"$error":"#N/A"}},{"$f":"IF(Data!J$23=\"\",NA(),IF(AND($A$3=List!$A$14,Status!$Q$17=1),Data!J$23,IF(AND($A$3=List!$A$15,Status!$R$17=1),Data!J$23,NA())))","v":{"$error":"#N/A"}},{"$f":"IF(Data!K$23=\"\",NA(),IF(AND($A$3=List!$A$14,Status!$Q$17=1),Data!K$23,IF(AND($A$3=List!$A$15,Status!$R$17=1),Data!K$23,NA())))","v":{"$error":"#N/A"}},{"$f":"IF(Data!L$23=\"\",NA(),IF(AND($A$3=List!$A$14,Status!$Q$17=1),Data!L$23,IF(AND($A$3=List!$A$15,Status!$R$17=1),Data!L$23,NA())))","v":{"$error":"#N/A"}},{"$f":"IF(Data!M$23=\"\",NA(),IF(AND($A$3=List!$A$14,Status!$Q$17=1),Data!M$23,IF(AND($A$3=List!$A$15,Status!$R$17=1),Data!M$23,NA())))","v":{"$error":"#N/A"}},{"$f":"IF(Data!N$23=\"\",NA(),IF(AND($A$3=List!$A$14,Status!$Q$17=1),Data!N$23,IF(AND($A$3=List!$A$15,Status!$R$17=1),Data!N$23,NA())))","v":{"$error":"#N/A"}},{"$f":"IF(Data!O$23=\"\",NA(),IF(AND($A$3=List!$A$14,Status!$Q$17=1),Data!O$23,IF(AND($A$3=List!$A$15,Status!$R$17=1),Data!O$23,NA())))","v":{"$error":"#N/A"}},{"$f":"IF(Data!P$23=\"\",NA(),IF(AND($A$3=List!$A$14,Status!$Q$17=1),Data!P$23,IF(AND($A$3=List!$A$15,Status!$R$17=1),Data!P$23,NA())))","v":{"$error":"#N/A"}},{"$f":"IF(Data!Q$23=\"\",NA(),IF(AND($A$3=List!$A$14,Status!$Q$17=1),Data!Q$23,IF(AND($A$3=List!$A$15,Status!$R$17=1),Data!Q$23,NA())))","v":{"$error":"#N/A"}},{"$f":"IF(Data!R$23=\"\",NA(),IF(AND($A$3=List!$A$14,Status!$Q$17=1),Data!R$23,IF(AND($A$3=List!$A$15,Status!$R$17=1),Data!R$23,NA())))","v":{"$error":"#N/A"}},{"$f":"IF(Data!S$23=\"\",NA(),IF(AND($A$3=List!$A$14,Status!$Q$17=1),Data!S$23,IF(AND($A$3=List!$A$15,Status!$R$17=1),Data!S$23,NA())))","v":{"$error":"#N/A"}}]
[{"$f":"A27","v":false},{"$f":"B27","v":"Meta"},{"$f":"IF(Data!H24=\"\",0,IF($A$31=FALSE,0,Data!H24))","v":0},{"$f":"IF(Data!I24=\"\",NA(),IF($A$31=FALSE,NA(),Data!I24))","v":{"$error":"#N/A"}},{"$f":"IF(Data!J24=\"\",NA(),IF($A$31=FALSE,NA(),Data!J24))","v":{"$error":"#N/A"}},{"$f":"IF(Data!K24=\"\",NA(),IF($A$31=FALSE,NA(),Data!K24))","v":{"$error":"#N/A"}},{"$f":"IF(Data!L24=\"\",NA(),IF($A$31=FALSE,NA(),Data!L24))","v":{"$error":"#N/A"}},{"$f":"IF(Data!M24=\"\",NA(),IF($A$31=FALSE,NA(),Data!M24))","v":{"$error":"#N/A"}},{"$f":"IF(Data!N24=\"\",NA(),IF($A$31=FALSE,NA(),Data!N24))","v":{"$error":"#N/A"}},{"$f":"IF(Data!O24=\"\",NA(),IF($A$31=FALSE,NA(),Data!O24))","v":{"$error":"#N/A"}},{"$f":"IF(Data!P24=\"\",NA(),IF($A$31=FALSE,NA(),Data!P24))","v":{"$error":"#N/A"}},{"$f":"IF(Data!Q24=\"\",NA(),IF($A$31=FALSE,NA(),Data!Q24))","v":{"$error":"#N/A"}},{"$f":"IF(Data!R24=\"\",NA(),IF($A$31=FALSE,NA(),Data!R24))","v":{"$error":"#N/A"}},{"$f":"IF(Data!S24=\"\",NA(),IF($A$31=FALSE,NA(),Data!S24))","v":{"$error":"#N/A"}}]
[null,"Red",{"$f":"IF(Data!H$26=\"\",0,IF(AND($A$3=List!$A$14,Status!$Q$19=-1),Data!H$26,IF(AND($A$3=List!$A$15,Status!$R$19=-1),Data!H$26,0)))","v":0},{"$f":"IF(Data!I$26=\"\",NA(),IF(AND($A$3=List!$A$14,Status!$Q$19=-1),Data!I$26,IF(AND($A$3=List!$A$15,Status!$R$19=-1),Data!I$26,NA())))","v":{"$error":"#N/A"}},{"$f":"IF(Data!J$26=\"\",NA(),IF(AND($A$3=List!$A$14,Status!$Q$19=-1),Data!J$26,IF(AND($A$3=List!$A$15,Status!$R$19=-1),Data!J$26,NA())))","v":{"$error":"#N/A"}},{"$f":"IF(Data!K$26=\"\",NA(),IF(AND($A$3=List!$A$14,Status!$Q$19=-1),Data!K$26,IF(AND($A$3=List!$A$15,Status!$R$19=-1),Data!K$26,NA())))","v":{"$error":"#N/A"}},{"$f":"IF(Data!L$26=\"\",NA(),IF(AND($A$3=List!$A$14,Status!$Q$19=-1),Data!L$26,IF(AND($A$3=List!$A$15,Status!$R$19=-1),Data!L$26,NA())))","v":{"$error":"#N/A"}},{"$f":"IF(Data!M$26=\"\",NA(),IF(AND($A$3=List!$A$14,Status!$Q$19=-1),Data!M$26,IF(AND($A$3=List!$A$15,Status!$R$19=-1),Data!M$26,NA())))","v":{"$error":"#N/A"}},{"$f":"IF(Data!N$26=\"\",NA(),IF(AND($A$3=List!$A$14,Status!$Q$19=-1),Data!N$26,IF(AND($A$3=List!$A$15,Status!$R$19=-1),Data!N$26,NA())))","v":{"$error":"#N/A"}},{"$f":"IF(Data!O$26=\"\",NA(),IF(AND($A$3=List!$A$14,Status!$Q$19=-1),Data!O$26,IF(AND($A$3=List!$A$15,Status!$R$19=-1),Data!O$26,NA())))","v":{"$error":"#N/A"}},{"$f":"IF(Data!P$26=\"\",NA(),IF(AND($A$3=List!$A$14,Status!$Q$19=-1),Data!P$26,IF(AND($A$3=List!$A$15,Status!$R$19=-1),Data!P$26,NA())))","v":{"$error":"#N/A"}},{"$f":"IF(Data!Q$26=\"\",NA(),IF(AND($A$3=List!$A$14,Status!$Q$19=-1),Data!Q$26,IF(AND($A$3=List!$A$15,Status!$R$19=-1),Data!Q$26,NA())))","v":{"$error":"#N/A"}},{"$f":"IF(Data!R$26=\"\",NA(),IF(AND($A$3=List!$A$14,Status!$Q$19=-1),Data!R$26,IF(AND($A$3=List!$A$15,Status!$R$19=-1),Data!R$26,NA())))","v":{"$error":"#N/A"}},{"$f":"IF(Data!S$26=\"\",NA(),IF(AND($A$3=List!$A$14,Status!$Q$19=-1),Data!S$26,IF(AND($A$3=List!$A$15,Status!$R$19=-1),Data!S$26,NA())))","v":{"$error":"#N/A"}}]
[null,"Yellow",{"$f":"IF(Data!H$26=\"\",0,IF(AND($A$3=List!$A$14,Status!$Q$19=0),Data!H$26,IF(AND($A$3=List!$A$15,Status!$R$19=0),Data!H$26,0)))","v":15000},{"$f":"IF(Data!I$26=\"\",NA(),IF(AND($A$3=List!$A$14,Status!$Q$19=0),Data!I$26,IF(AND($A$3=List!$A$15,Status!$R$19=0),Data!I$26,NA())))","v":15348},{"$f":"IF(Data!J$26=\"\",NA(),IF(AND($A$3=List!$A$14,Status!$Q$19=0),Data!J$26,IF(AND($A$3=List!$A$15,Status!$R$19=0),Data!J$26,NA())))","v":{"$error":"#N/A"}},{"$f":"IF(Data!K$26=\"\",NA(),IF(AND($A$3=List!$A$14,Status!$Q$19=0),Data!K$26,IF(AND($A$3=List!$A$15,Status!$R$19=0),Data!K$26,NA())))","v":{"$error":"#N/A"}},{"$f":"IF(Data!L$26=\"\",NA(),IF(AND($A$3=List!$A$14,Status!$Q$19=0),Data!L$26,IF(AND($A$3=List!$A$15,Status!$R$19=0),Data!L$26,NA())))","v":{"$error":"#N/A"}},{"$f":"IF(Data!M$26=\"\",NA(),IF(AND($A$3=List!$A$14,Status!$Q$19=0),Data!M$26,IF(AND($A$3=List!$A$15,Status!$R$19=0),Data!M$26,NA())))","v":{"$error":"#N/A"}},{"$f":"IF(Data!N$26=\"\",NA(),IF(AND($A$3=List!$A$14,Status!$Q$19=0),Data!N$26,IF(AND($A$3=List!$A$15,Status!$R$19=0),Data!N$26,NA())))","v":{"$error":"#N/A"}},{"$f":"IF(Data!O$26=\"\",NA(),IF(AND($A$3=List!$A$14,Status!$Q$19=0),Data!O$26,IF(AND($A$3=List!$A$15,Status!$R$19=0),Data!O$26,NA())))","v":{"$error":"#N/A"}},{"$f":"IF(Data!P$26=\"\",NA(),IF(AND($A$3=List!$A$14,Status!$Q$19=0),Data!P$26,IF(AND($A$3=List!$A$15,Status!$R$19=0),Data!P$26,NA())))","v":{"$error":"#N/A"}},{"$f":"IF(Data!Q$26=\"\",NA(),IF(AND($A$3=List!$A$14,Status!$Q$19=0),Data!Q$26,IF(AND($A$3=List!$A$15,Status!$R$19=0),Data!Q$26,NA())))","v":{"$error":"#N/A"}},{"$f":"IF(Data!R$26=\"\",NA(),IF(AND($A$3=List!$A$14,Status!$Q$19=0),Data!R$26,IF(AND($A$3=List!$A$15,Status!$R$19=0),Data!R$26,NA())))","v":{"$error":"#N/A"}},{"$f":"IF(Data!S$26=\"\",NA(),IF(AND($A$3=List!$A$14,Status!$Q$19=0),Data!S$26,IF(AND($A$3=List!$A$15,Status!$R$19=0),Data!S$26,NA())))","v":{"$error":"#N/A"}}]
[null,"Green",{"$f":"IF(Data!H$26=\"\",0,IF(AND($A$3=List!$A$14,Status!$Q$19=1),Data!H$26,IF(AND($A$3=List!$A$15,Status!$R$19=1),Data!H$26,0)))","v":0},{"$f":"IF(Data!I$26=\"\",NA(),IF(AND($A$3=List!$A$14,Status!$Q$19=1),Data!I$26,IF(AND($A$3=List!$A$15,Status!$R$19=1),Data!I$26,NA())))","v":{"$error":"#N/A"}},{"$f":"IF(Data!J$26=\"\",NA(),IF(AND($A$3=List!$A$14,Status!$Q$19=1),Data!J$26,IF(AND($A$3=List!$A$15,Status!$R$19=1),Data!J$26,NA())))","v":{"$error":"#N/A"}},{"$f":"IF(Data!K$26=\"\",NA(),IF(AND($A$3=List!$A$14,Status!$Q$19=1),Data!K$26,IF(AND($A$3=List!$A$15,Status!$R$19=1),Data!K$26,NA())))","v":{"$error":"#N/A"}},{"$f":"IF(Data!L$26=\"\",NA(),IF(AND($A$3=List!$A$14,Status!$Q$19=1),Data!L$26,IF(AND($A$3=List!$A$15,Status!$R$19=1),Data!L$26,NA())))","v":{"$error":"#N/A"}},{"$f":"IF(Data!M$26=\"\",NA(),IF(AND($A$3=List!$A$14,Status!$Q$19=1),Data!M$26,IF(AND($A$3=List!$A$15,Status!$R$19=1),Data!M$26,NA())))","v":{"$error":"#N/A"}},{"$f":"IF(Data!N$26=\"\",NA(),IF(AND($A$3=List!$A$14,Status!$Q$19=1),Data!N$26,IF(AND($A$3=List!$A$15,Status!$R$19=1),Data!N$26,NA())))","v":{"$error":"#N/A"}},{"$f":"IF(Data!O$26=\"\",NA(),IF(AND($A$3=List!$A$14,Status!$Q$19=1),Data!O$26,IF(AND($A$3=List!$A$15,Status!$R$19=1),Data!O$26,NA())))","v":{"$error":"#N/A"}},{"$f":"IF(Data!P$26=\"\",NA(),IF(AND($A$3=List!$A$14,Status!$Q$19=1),Data!P$26,IF(AND($A$3=List!$A$15,Status!$R$19=1),Data!P$26,NA())))","v":{"$error":"#N/A"}},{"$f":"IF(Data!Q$26=\"\",NA(),IF(AND($A$3=List!$A$14,Status!$Q$19=1),Data!Q$26,IF(AND($A$3=List!$A$15,Status!$R$19=1),Data!Q$26,NA())))","v":{"$error":"#N/A"}},{"$f":"IF(Data!R$26=\"\",NA(),IF(AND($A$3=List!$A$14,Status!$Q$19=1),Data!R$26,IF(AND($A$3=List!$A$15,Status!$R$19=1),Data!R$26,NA())))","v":{"$error":"#N/A"}},{"$f":"IF(Data!S$26=\"\",NA(),IF(AND($A$3=List!$A$14,Status!$Q$19=1),Data!S$26,IF(AND($A$3=List!$A$15,Status!$R$19=1),Data!S$26,NA())))","v":{"$error":"#N/A"}}]
[{"$f":"A31","v":false},{"$f":"B31","v":"Meta"},{"$f":"IF(Data!H27=\"\",0,IF($A$35=FALSE,0,Data!H27))","v":0},{"$f":"IF(Data!I27=\"\",NA(),IF($A$35=FALSE,NA(),Data!I27))","v":{"$error":"#N/A"}},{"$f":"IF(Data!J27=\"\",NA(),IF($A$35=FALSE,NA(),Data!J27))","v":{"$error":"#N/A"}},{"$f":"IF(Data!K27=\"\",NA(),IF($A$35=FALSE,NA(),Data!K27))","v":{"$error":"#N/A"}},{"$f":"IF(Data!L27=\"\",NA(),IF($A$35=FALSE,NA(),Data!L27))","v":{"$error":"#N/A"}},{"$f":"IF(Data!M27=\"\",NA(),IF($A$35=FALSE,NA(),Data!M27))","v":{"$error":"#N/A"}},{"$f":"IF(Data!N27=\"\",NA(),IF($A$35=FALSE,NA(),Data!N27))","v":{"$error":"#N/A"}},{"$f":"IF(Data!O27=\"\",NA(),IF($A$35=FALSE,NA(),Data!O27))","v":{"$error":"#N/A"}},{"$f":"IF(Data!P27=\"\",NA(),IF($A$35=FALSE,NA(),Data!P27))","v":{"$error":"#N/A"}},{"$f":"IF(Data!Q27=\"\",NA(),IF($A$35=FALSE,NA(),Data!Q27))","v":{"$error":"#N/A"}},{"$f":"IF(Data!R27=\"\",NA(),IF($A$35=FALSE,NA(),Data!R27))","v":{"$error":"#N/A"}},{"$f":"IF(Data!S27=\"\",NA(),IF($A$35=FALSE,NA(),Data!S27))","v":{"$error":"#N/A"}}]
[null,"Red",{"$f":"IF(Data!H$29=\"\",0,IF(AND($A$3=List!$A$14,Status!$Q$21=-1),Data!H$29,IF(AND($A$3=List!$A$15,Status!$R$21=-1),Data!H$29,0)))","v":0},{"$f":"IF(Data!I$29=\"\",NA(),IF(AND($A$3=List!$A$14,Status!$Q$21=-1),Data!I$29,IF(AND($A$3=List!$A$15,Status!$R$21=-1),Data!I$29,NA())))","v":{"$error":"#N/A"}},{"$f":"IF(Data!J$29=\"\",NA(),IF(AND($A$3=List!$A$14,Status!$Q$21=-1),Data!J$29,IF(AND($A$3=List!$A$15,Status!$R$21=-1),Data!J$29,NA())))","v":{"$error":"#N/A"}},{"$f":"IF(Data!K$29=\"\",NA(),IF(AND($A$3=List!$A$14,Status!$Q$21=-1),Data!K$29,IF(AND($A$3=List!$A$15,Status!$R$21=-1),Data!K$29,NA())))","v":{"$error":"#N/A"}},{"$f":"IF(Data!L$29=\"\",NA(),IF(AND($A$3=List!$A$14,Status!$Q$21=-1),Data!L$29,IF(AND($A$3=List!$A$15,Status!$R$21=-1),Data!L$29,NA())))","v":{"$error":"#N/A"}},{"$f":"IF(Data!M$29=\"\",NA(),IF(AND($A$3=List!$A$14,Status!$Q$21=-1),Data!M$29,IF(AND($A$3=List!$A$15,Status!$R$21=-1),Data!M$29,NA())))","v":{"$error":"#N/A"}},{"$f":"IF(Data!N$29=\"\",NA(),IF(AND($A$3=List!$A$14,Status!$Q$21=-1),Data!N$29,IF(AND($A$3=List!$A$15,Status!$R$21=-1),Data!N$29,NA())))","v":{"$error":"#N/A"}},{"$f":"IF(Data!O$29=\"\",NA(),IF(AND($A$3=List!$A$14,Status!$Q$21=-1),Data!O$29,IF(AND($A$3=List!$A$15,Status!$R$21=-1),Data!O$29,NA())))","v":{"$error":"#N/A"}},{"$f":"IF(Data!P$29=\"\",NA(),IF(AND($A$3=List!$A$14,Status!$Q$21=-1),Data!P$29,IF(AND($A$3=List!$A$15,Status!$R$21=-1),Data!P$29,NA())))","v":{"$error":"#N/A"}},{"$f":"IF(Data!Q$29=\"\",NA(),IF(AND($A$3=List!$A$14,Status!$Q$21=-1),Data!Q$29,IF(AND($A$3=List!$A$15,Status!$R$21=-1),Data!Q$29,NA())))","v":{"$error":"#N/A"}},{"$f":"IF(Data!R$29=\"\",NA(),IF(AND($A$3=List!$A$14,Status!$Q$21=-1),Data!R$29,IF(AND($A$3=List!$A$15,Status!$R$21=-1),Data!R$29,NA())))","v":{"$error":"#N/A"}},{"$f":"IF(Data!S$29=\"\",NA(),IF(AND($A$3=List!$A$14,Status!$Q$21=-1),Data!S$29,IF(AND($A$3=List!$A$15,Status!$R$21=-1),Data!S$29,NA())))","v":{"$error":"#N/A"}}]
[null,"Yellow",{"$f":"IF(Data!H$29=\"\",0,IF(AND($A$3=List!$A$14,Status!$Q$21=0),Data!H$29,IF(AND($A$3=List!$A$15,Status!$R$21=0),Data!H$29,0)))","v":0},{"$f":"IF(Data!I$29=\"\",NA(),IF(AND($A$3=List!$A$14,Status!$Q$21=0),Data!I$29,IF(AND($A$3=List!$A$15,Status!$R$21=0),Data!I$29,NA())))","v":{"$error":"#N/A"}},{"$f":"IF(Data!J$29=\"\",NA(),IF(AND($A$3=List!$A$14,Status!$Q$21=0),Data!J$29,IF(AND($A$3=List!$A$15,Status!$R$21=0),Data!J$29,NA())))","v":{"$error":"#N/A"}},{"$f":"IF(Data!K$29=\"\",NA(),IF(AND($A$3=List!$A$14,Status!$Q$21=0),Data!K$29,IF(AND($A$3=List!$A$15,Status!$R$21=0),Data!K$29,NA())))","v":{"$error":"#N/A"}},{"$f":"IF(Data!L$29=\"\",NA(),IF(AND($A$3=List!$A$14,Status!$Q$21=0),Data!L$29,IF(AND($A$3=List!$A$15,Status!$R$21=0),Data!L$29,NA())))","v":{"$error":"#N/A"}},{"$f":"IF(Data!M$29=\"\",NA(),IF(AND($A$3=List!$A$14,Status!$Q$21=0),Data!M$29,IF(AND($A$3=List!$A$15,Status!$R$21=0),Data!M$29,NA())))","v":{"$error":"#N/A"}},{"$f":"IF(Data!N$29=\"\",NA(),IF(AND($A$3=List!$A$14,Status!$Q$21=0),Data!N$29,IF(AND($A$3=List!$A$15,Status!$R$21=0),Data!N$29,NA())))","v":{"$error":"#N/A"}},{"$f":"IF(Data!O$29=\"\",NA(),IF(AND($A$3=List!$A$14,Status!$Q$21=0),Data!O$29,IF(AND($A$3=List!$A$15,Status!$R$21=0),Data!O$29,NA())))","v":{"$error":"#N/A"}},{"$f":"IF(Data!P$29=\"\",NA(),IF(AND($A$3=List!$A$14,Status!$Q$21=0),Data!P$29,IF(AND($A$3=List!$A$15,Status!$R$21=0),Data!P$29,NA())))","v":{"$error":"#N/A"}},{"$f":"IF(Data!Q$29=\"\",NA(),IF(AND($A$3=List!$A$14,Status!$Q$21=0),Data!Q$29,IF(AND($A$3=List!$A$15,Status!$R$21=0),Data!Q$29,NA())))","v":{"$error":"#N/A"}},{"$f":"IF(Data!R$29=\"\",NA(),IF(AND($A$3=List!$A$14,Status!$Q$21=0),Data!R$29,IF(AND($A$3=List!$A$15,Status!$R$21=0),Data!R$29,NA())))","v":{"$error":"#N/A"}},{"$f":"IF(Data!S$29=\"\",NA(),IF(AND($A$3=List!$A$14,Status!$Q$21=0),Data!S$29,IF(AND($A$3=List!$A$15,Status!$R$21=0),Data!S$29,NA())))","v":{"$error":"#N/A"}}]
[null,"Green",{"$f":"IF(Data!H$29=\"\",0,IF(AND($A$3=List!$A$14,Status!$Q$21=1),Data!H$29,IF(AND($A$3=List!$A$15,Status!$R$21=1),Data!H$29,0)))","v":0},{"$f":"IF(Data!I$29=\"\",NA(),IF(AND($A$3=List!$A$14,Status!$Q$21=1),Data!I$29,IF(AND($A$3=List!$A$15,Status!$R$21=1),Data!I$29,NA())))","v":{"$error":"#N/A"}},{"$f":"IF(Data!J$29=\"\",NA(),IF(AND($A$3=List!$A$14,Status!$Q$21=1),Data!J$29,IF(AND($A$3=List!$A$15,Status!$R$21=1),Data!J$29,NA())))","v":{"$error":"#N/A"}},{"$f":"IF(Data!K$29=\"\",NA(),IF(AND($A$3=List!$A$14,Status!$Q$21=1),Data!K$29,IF(AND($A$3=List!$A$15,Status!$R$21=1),Data!K$29,NA())))","v":{"$error":"#N/A"}},{"$f":"IF(Data!L$29=\"\",NA(),IF(AND($A$3=List!$A$14,Status!$Q$21=1),Data!L$29,IF(AND($A$3=List!$A$15,Status!$R$21=1),Data!L$29,NA())))","v":{"$error":"#N/A"}},{"$f":"IF(Data!M$29=\"\",NA(),IF(AND($A$3=List!$A$14,Status!$Q$21=1),Data!M$29,IF(AND($A$3=List!$A$15,Status!$R$21=1),Data!M$29,NA())))","v":{"$error":"#N/A"}},{"$f":"IF(Data!N$29=\"\",NA(),IF(AND($A$3=List!$A$14,Status!$Q$21=1),Data!N$29,IF(AND($A$3=List!$A$15,Status!$R$21=1),Data!N$29,NA())))","v":{"$error":"#N/A"}},{"$f":"IF(Data!O$29=\"\",NA(),IF(AND($A$3=List!$A$14,Status!$Q$21=1),Data!O$29,IF(AND($A$3=List!$A$15,Status!$R$21=1),Data!O$29,NA())))","v":{"$error":"#N/A"}},{"$f":"IF(Data!P$29=\"\",NA(),IF(AND($A$3=List!$A$14,Status!$Q$21=1),Data!P$29,IF(AND($A$3=List!$A$15,Status!$R$21=1),Data!P$29,NA())))","v":{"$error":"#N/A"}},{"$f":"IF(Data!Q$29=\"\",NA(),IF(AND($A$3=List!$A$14,Status!$Q$21=1),Data!Q$29,IF(AND($A$3=List!$A$15,Status!$R$21=1),Data!Q$29,NA())))","v":{"$error":"#N/A"}},{"$f":"IF(Data!R$29=\"\",NA(),IF(AND($A$3=List!$A$14,Status!$Q$21=1),Data!R$29,IF(AND($A$3=List!$A$15,Status!$R$21=1),Data!R$29,NA())))","v":{"$error":"#N/A"}},{"$f":"IF(Data!S$29=\"\",NA(),IF(AND($A$3=List!$A$14,Status!$Q$21=1),Data!S$29,IF(AND($A$3=List!$A$15,Status!$R$21=1),Data!S$29,NA())))","v":{"$error":"#N/A"}}]
[{"$f":"A35","v":false},{"$f":"B35","v":"Meta"},{"$f":"IF(Data!H30=\"\",0,IF($A$39=FALSE,0,Data!H30))","v":0},{"$f":"IF(Data!I30=\"\",NA(),IF($A$39=FALSE,NA(),Data!I30))","v":{"$error":"#N/A"}},{"$f":"IF(Data!J30=\"\",NA(),IF($A$39=FALSE,NA(),Data!J30))","v":{"$error":"#N/A"}},{"$f":"IF(Data!K30=\"\",NA(),IF($A$39=FALSE,NA(),Data!K30))","v":{"$error":"#N/A"}},{"$f":"IF(Data!L30=\"\",NA(),IF($A$39=FALSE,NA(),Data!L30))","v":{"$error":"#N/A"}},{"$f":"IF(Data!M30=\"\",NA(),IF($A$39=FALSE,NA(),Data!M30))","v":{"$error":"#N/A"}},{"$f":"IF(Data!N30=\"\",NA(),IF($A$39=FALSE,NA(),Data!N30))","v":{"$error":"#N/A"}},{"$f":"IF(Data!O30=\"\",NA(),IF($A$39=FALSE,NA(),Data!O30))","v":{"$error":"#N/A"}},{"$f":"IF(Data!P30=\"\",NA(),IF($A$39=FALSE,NA(),Data!P30))","v":{"$error":"#N/A"}},{"$f":"IF(Data!Q30=\"\",NA(),IF($A$39=FALSE,NA(),Data!Q30))","v":{"$error":"#N/A"}},{"$f":"IF(Data!R30=\"\",NA(),IF($A$39=FALSE,NA(),Data!R30))","v":{"$error":"#N/A"}},{"$f":"IF(Data!S30=\"\",NA(),IF($A$39=FALSE,NA(),Data!S30))","v":{"$error":"#N/A"}}]
[null,"Red",{"$f":"IF(Data!H$32=\"\",0,IF(AND($A$3=List!$A$14,Status!$Q$23=-1),Data!H$32,IF(AND($A$3=List!$A$15,Status!$R$23=-1),Data!H$32,0)))","v":0},{"$f":"IF(Data!I$32=\"\",NA(),IF(AND($A$3=List!$A$14,Status!$Q$23=-1),Data!I$32,IF(AND($A$3=List!$A$15,Status!$R$23=-1),Data!I$32,NA())))","v":{"$error":"#N/A"}},{"$f":"IF(Data!J$32=\"\",NA(),IF(AND($A$3=List!$A$14,Status!$Q$23=-1),Data!J$32,IF(AND($A$3=List!$A$15,Status!$R$23=-1),Data!J$32,NA())))","v":{"$error":"#N/A"}},{"$f":"IF(Data!K$32=\"\",NA(),IF(AND($A$3=List!$A$14,Status!$Q$23=-1),Data!K$32,IF(AND($A$3=List!$A$15,Status!$R$23=-1),Data!K$32,NA())))","v":{"$error":"#N/A"}},{"$f":"IF(Data!L$32=\"\",NA(),IF(AND($A$3=List!$A$14,Status!$Q$23=-1),Data!L$32,IF(AND($A$3=List!$A$15,Status!$R$23=-1),Data!L$32,NA())))","v":{"$error":"#N/A"}},{"$f":"IF(Data!M$32=\"\",NA(),IF(AND($A$3=List!$A$14,Status!$Q$23=-1),Data!M$32,IF(AND($A$3=List!$A$15,Status!$R$23=-1),Data!M$32,NA())))","v":{"$error":"#N/A"}},{"$f":"IF(Data!N$32=\"\",NA(),IF(AND($A$3=List!$A$14,Status!$Q$23=-1),Data!N$32,IF(AND($A$3=List!$A$15,Status!$R$23=-1),Data!N$32,NA())))","v":{"$error":"#N/A"}},{"$f":"IF(Data!O$32=\"\",NA(),IF(AND($A$3=List!$A$14,Status!$Q$23=-1),Data!O$32,IF(AND($A$3=List!$A$15,Status!$R$23=-1),Data!O$32,NA())))","v":{"$error":"#N/A"}},{"$f":"IF(Data!P$32=\"\",NA(),IF(AND($A$3=List!$A$14,Status!$Q$23=-1),Data!P$32,IF(AND($A$3=List!$A$15,Status!$R$23=-1),Data!P$32,NA())))","v":{"$error":"#N/A"}},{"$f":"IF(Data!Q$32=\"\",NA(),IF(AND($A$3=List!$A$14,Status!$Q$23=-1),Data!Q$32,IF(AND($A$3=List!$A$15,Status!$R$23=-1),Data!Q$32,NA())))","v":{"$error":"#N/A"}},{"$f":"IF(Data!R$32=\"\",NA(),IF(AND($A$3=List!$A$14,Status!$Q$23=-1),Data!R$32,IF(AND($A$3=List!$A$15,Status!$R$23=-1),Data!R$32,NA())))","v":{"$error":"#N/A"}},{"$f":"IF(Data!S$32=\"\",NA(),IF(AND($A$3=List!$A$14,Status!$Q$23=-1),Data!S$32,IF(AND($A$3=List!$A$15,Status!$R$23=-1),Data!S$32,NA())))","v":{"$error":"#N/A"}}]
[null,"Yellow",{"$f":"IF(Data!H$32=\"\",0,IF(AND($A$3=List!$A$14,Status!$Q$23=0),Data!H$32,IF(AND($A$3=List!$A$15,Status!$R$23=0),Data!H$32,0)))","v":0},{"$f":"IF(Data!I$32=\"\",NA(),IF(AND($A$3=List!$A$14,Status!$Q$23=0),Data!I$32,IF(AND($A$3=List!$A$15,Status!$R$23=0),Data!I$32,NA())))","v":{"$error":"#N/A"}},{"$f":"IF(Data!J$32=\"\",NA(),IF(AND($A$3=List!$A$14,Status!$Q$23=0),Data!J$32,IF(AND($A$3=List!$A$15,Status!$R$23=0),Data!J$32,NA())))","v":{"$error":"#N/A"}},{"$f":"IF(Data!K$32=\"\",NA(),IF(AND($A$3=List!$A$14,Status!$Q$23=0),Data!K$32,IF(AND($A$3=List!$A$15,Status!$R$23=0),Data!K$32,NA())))","v":{"$error":"#N/A"}},{"$f":"IF(Data!L$32=\"\",NA(),IF(AND($A$3=List!$A$14,Status!$Q$23=0),Data!L$32,IF(AND($A$3=List!$A$15,Status!$R$23=0),Data!L$32,NA())))","v":{"$error":"#N/A"}},{"$f":"IF(Data!M$32=\"\",NA(),IF(AND($A$3=List!$A$14,Status!$Q$23=0),Data!M$32,IF(AND($A$3=List!$A$15,Status!$R$23=0),Data!M$32,NA())))","v":{"$error":"#N/A"}},{"$f":"IF(Data!N$32=\"\",NA(),IF(AND($A$3=List!$A$14,Status!$Q$23=0),Data!N$32,IF(AND($A$3=List!$A$15,Status!$R$23=0),Data!N$32,NA())))","v":{"$error":"#N/A"}},{"$f":"IF(Data!O$32=\"\",NA(),IF(AND($A$3=List!$A$14,Status!$Q$23=0),Data!O$32,IF(AND($A$3=List!$A$15,Status!$R$23=0),Data!O$32,NA())))","v":{"$error":"#N/A"}},{"$f":"IF(Data!P$32=\"\",NA(),IF(AND($A$3=List!$A$14,Status!$Q$23=0),Data!P$32,IF(AND($A$3=List!$A$15,Status!$R$23=0),Data!P$32,NA())))","v":{"$error":"#N/A"}},{"$f":"IF(Data!Q$32=\"\",NA(),IF(AND($A$3=List!$A$14,Status!$Q$23=0),Data!Q$32,IF(AND($A$3=List!$A$15,Status!$R$23=0),Data!Q$32,NA())))","v":{"$error":"#N/A"}},{"$f":"IF(Data!R$32=\"\",NA(),IF(AND($A$3=List!$A$14,Status!$Q$23=0),Data!R$32,IF(AND($A$3=List!$A$15,Status!$R$23=0),Data!R$32,NA())))","v":{"$error":"#N/A"}},{"$f":"IF(Data!S$32=\"\",NA(),IF(AND($A$3=List!$A$14,Status!$Q$23=0),Data!S$32,IF(AND($A$3=List!$A$15,Status!$R$23=0),Data!S$32,NA())))","v":{"$error":"#N/A"}}]
[null,"Green",{"$f":"IF(Data!H$32=\"\",0,IF(AND($A$3=List!$A$14,Status!$Q$23=1),Data!H$32,IF(AND($A$3=List!$A$15,Status!$R$23=1),Data!H$32,0)))","v":0},{"$f":"IF(Data!I$32=\"\",NA(),IF(AND($A$3=List!$A$14,Status!$Q$23=1),Data!I$32,IF(AND($A$3=List!$A$15,Status!$R$23=1),Data!I$32,NA())))","v":{"$error":"#N/A"}},{"$f":"IF(Data!J$32=\"\",NA(),IF(AND($A$3=List!$A$14,Status!$Q$23=1),Data!J$32,IF(AND($A$3=List!$A$15,Status!$R$23=1),Data!J$32,NA())))","v":{"$error":"#N/A"}},{"$f":"IF(Data!K$32=\"\",NA(),IF(AND($A$3=List!$A$14,Status!$Q$23=1),Data!K$32,IF(AND($A$3=List!$A$15,Status!$R$23=1),Data!K$32,NA())))","v":{"$error":"#N/A"}},{"$f":"IF(Data!L$32=\"\",NA(),IF(AND($A$3=List!$A$14,Status!$Q$23=1),Data!L$32,IF(AND($A$3=List!$A$15,Status!$R$23=1),Data!L$32,NA())))","v":{"$error":"#N/A"}},{"$f":"IF(Data!M$32=\"\",NA(),IF(AND($A$3=List!$A$14,Status!$Q$23=1),Data!M$32,IF(AND($A$3=List!$A$15,Status!$R$23=1),Data!M$32,NA())))","v":{"$error":"#N/A"}},{"$f":"IF(Data!N$32=\"\",NA(),IF(AND($A$3=List!$A$14,Status!$Q$23=1),Data!N$32,IF(AND($A$3=List!$A$15,Status!$R$23=1),Data!N$32,NA())))","v":{"$error":"#N/A"}},{"$f":"IF(Data!O$32=\"\",NA(),IF(AND($A$3=List!$A$14,Status!$Q$23=1),Data!O$32,IF(AND($A$3=List!$A$15,Status!$R$23=1),Data!O$32,NA())))","v":{"$error":"#N/A"}},{"$f":"IF(Data!P$32=\"\",NA(),IF(AND($A$3=List!$A$14,Status!$Q$23=1),Data!P$32,IF(AND($A$3=List!$A$15,Status!$R$23=1),Data!P$32,NA())))","v":{"$error":"#N/A"}},{"$f":"IF(Data!Q$32=\"\",NA(),IF(AND($A$3=List!$A$14,Status!$Q$23=1),Data!Q$32,IF(AND($A$3=List!$A$15,Status!$R$23=1),Data!Q$32,NA())))","v":{"$error":"#N/A"}},{"$f":"IF(Data!R$32=\"\",NA(),IF(AND($A$3=List!$A$14,Status!$Q$23=1),Data!R$32,IF(AND($A$3=List!$A$15,Status!$R$23=1),Data!R$32,NA())))","v":{"$error":"#N/A"}},{"$f":"IF(Data!S$32=\"\",NA(),IF(AND($A$3=List!$A$14,Status!$Q$23=1),Data!S$32,IF(AND($A$3=List!$A$15,Status!$R$23=1),Data!S$32,NA())))","v":{"$error":"#N/A"}}]
[{"$f":"A39","v":false},{"$f":"B39","v":"Meta"},{"$f":"IF(Data!H33=\"\",0,IF($A$43=FALSE,0,Data!H33))","v":0},{"$f":"IF(Data!I33=\"\",NA(),IF($A$43=FALSE,NA(),Data!I33))","v":{"$error":"#N/A"}},{"$f":"IF(Data!J33=\"\",NA(),IF($A$43=FALSE,NA(),Data!J33))","v":{"$error":"#N/A"}},{"$f":"IF(Data!K33=\"\",NA(),IF($A$43=FALSE,NA(),Data!K33))","v":{"$error":"#N/A"}},{"$f":"IF(Data!L33=\"\",NA(),IF($A$43=FALSE,NA(),Data!L33))","v":{"$error":"#N/A"}},{"$f":"IF(Data!M33=\"\",NA(),IF($A$43=FALSE,NA(),Data!M33))","v":{"$error":"#N/A"}},{"$f":"IF(Data!N33=\"\",NA(),IF($A$43=FALSE,NA(),Data!N33))","v":{"$error":"#N/A"}},{"$f":"IF(Data!O33=\"\",NA(),IF($A$43=FALSE,NA(),Data!O33))","v":{"$error":"#N/A"}},{"$f":"IF(Data!P33=\"\",NA(),IF($A$43=FALSE,NA(),Data!P33))","v":{"$error":"#N/A"}},{"$f":"IF(Data!Q33=\"\",NA(),IF($A$43=FALSE,NA(),Data!Q33))","v":{"$error":"#N/A"}},{"$f":"IF(Data!R33=\"\",NA(),IF($A$43=FALSE,NA(),Data!R33))","v":{"$error":"#N/A"}},{"$f":"IF(Data!S33=\"\",NA(),IF($A$43=FALSE,NA(),Data!S33))","v":{"$error":"#N/A"}}]
[null,"Red",{"$f":"IF(Data!H$35=\"\",0,IF(AND($A$3=List!$A$14,Status!$Q$25=-1),Data!H$35,IF(AND($A$3=List!$A$15,Status!$R$25=-1),Data!H$35,0)))","v":0},{"$f":"IF(Data!I$35=\"\",NA(),IF(AND($A$3=List!$A$14,Status!$Q$25=-1),Data!I$35,IF(AND($A$3=List!$A$15,Status!$R$25=-1),Data!I$35,NA())))","v":{"$error":"#N/A"}},{"$f":"IF(Data!J$35=\"\",NA(),IF(AND($A$3=List!$A$14,Status!$Q$25=-1),Data!J$35,IF(AND($A$3=List!$A$15,Status!$R$25=-1),Data!J$35,NA())))","v":{"$error":"#N/A"}},{"$f":"IF(Data!K$35=\"\",NA(),IF(AND($A$3=List!$A$14,Status!$Q$25=-1),Data!K$35,IF(AND($A$3=List!$A$15,Status!$R$25=-1),Data!K$35,NA())))","v":{"$error":"#N/A"}},{"$f":"IF(Data!L$35=\"\",NA(),IF(AND($A$3=List!$A$14,Status!$Q$25=-1),Data!L$35,IF(AND($A$3=List!$A$15,Status!$R$25=-1),Data!L$35,NA())))","v":{"$error":"#N/A"}},{"$f":"IF(Data!M$35=\"\",NA(),IF(AND($A$3=List!$A$14,Status!$Q$25=-1),Data!M$35,IF(AND($A$3=List!$A$15,Status!$R$25=-1),Data!M$35,NA())))","v":{"$error":"#N/A"}},{"$f":"IF(Data!N$35=\"\",NA(),IF(AND($A$3=List!$A$14,Status!$Q$25=-1),Data!N$35,IF(AND($A$3=List!$A$15,Status!$R$25=-1),Data!N$35,NA())))","v":{"$error":"#N/A"}},{"$f":"IF(Data!O$35=\"\",NA(),IF(AND($A$3=List!$A$14,Status!$Q$25=-1),Data!O$35,IF(AND($A$3=List!$A$15,Status!$R$25=-1),Data!O$35,NA())))","v":{"$error":"#N/A"}},{"$f":"IF(Data!P$35=\"\",NA(),IF(AND($A$3=List!$A$14,Status!$Q$25=-1),Data!P$35,IF(AND($A$3=List!$A$15,Status!$R$25=-1),Data!P$35,NA())))","v":{"$error":"#N/A"}},{"$f":"IF(Data!Q$35=\"\",NA(),IF(AND($A$3=List!$A$14,Status!$Q$25=-1),Data!Q$35,IF(AND($A$3=List!$A$15,Status!$R$25=-1),Data!Q$35,NA())))","v":{"$error":"#N/A"}},{"$f":"IF(Data!R$35=\"\",NA(),IF(AND($A$3=List!$A$14,Status!$Q$25=-1),Data!R$35,IF(AND($A$3=List!$A$15,Status!$R$25=-1),Data!R$35,NA())))","v":{"$error":"#N/A"}},{"$f":"IF(Data!S$35=\"\",NA(),IF(AND($A$3=List!$A$14,Status!$Q$25=-1),Data!S$35,IF(AND($A$3=List!$A$15,Status!$R$25=-1),Data!S$35,NA())))","v":{"$error":"#N/A"}}]
[null,"Yellow",{"$f":"IF(Data!H$35=\"\",0,IF(AND($A$3=List!$A$14,Status!$Q$25=0),Data!H$35,IF(AND($A$3=List!$A$15,Status!$R$25=0),Data!H$35,0)))","v":0},{"$f":"IF(Data!I$35=\"\",NA(),IF(AND($A$3=List!$A$14,Status!$Q$25=0),Data!I$35,IF(AND($A$3=List!$A$15,Status!$R$25=0),Data!I$35,NA())))","v":{"$error":"#N/A"}},{"$f":"IF(Data!J$35=\"\",NA(),IF(AND($A$3=List!$A$14,Status!$Q$25=0),Data!J$35,IF(AND($A$3=List!$A$15,Status!$R$25=0),Data!J$35,NA())))","v":{"$error":"#N/A"}},{"$f":"IF(Data!K$35=\"\",NA(),IF(AND($A$3=List!$A$14,Status!$Q$25=0),Data!K$35,IF(AND($A$3=List!$A$15,Status!$R$25=0),Data!K$35,NA())))","v":{"$error":"#N/A"}},{"$f":"IF(Data!L$35=\"\",NA(),IF(AND($A$3=List!$A$14,Status!$Q$25=0),Data!L$35,IF(AND($A$3=List!$A$15,Status!$R$25=0),Data!L$35,NA())))","v":{"$error":"#N/A"}},{"$f":"IF(Data!M$35=\"\",NA(),IF(AND($A$3=List!$A$14,Status!$Q$25=0),Data!M$35,IF(AND($A$3=List!$A$15,Status!$R$25=0),Data!M$35,NA())))","v":{"$error":"#N/A"}},{"$f":"IF(Data!N$35=\"\",NA(),IF(AND($A$3=List!$A$14,Status!$Q$25=0),Data!N$35,IF(AND($A$3=List!$A$15,Status!$R$25=0),Data!N$35,NA())))","v":{"$error":"#N/A"}},{"$f":"IF(Data!O$35=\"\",NA(),IF(AND($A$3=List!$A$14,Status!$Q$25=0),Data!O$35,IF(AND($A$3=List!$A$15,Status!$R$25=0),Data!O$35,NA())))","v":{"$error":"#N/A"}},{"$f":"IF(Data!P$35=\"\",NA(),IF(AND($A$3=List!$A$14,Status!$Q$25=0),Data!P$35,IF(AND($A$3=List!$A$15,Status!$R$25=0),Data!P$35,NA())))","v":{"$error":"#N/A"}},{"$f":"IF(Data!Q$35=\"\",NA(),IF(AND($A$3=List!$A$14,Status!$Q$25=0),Data!Q$35,IF(AND($A$3=List!$A$15,Status!$R$25=0),Data!Q$35,NA())))","v":{"$error":"#N/A"}},{"$f":"IF(Data!R$35=\"\",NA(),IF(AND($A$3=List!$A$14,Status!$Q$25=0),Data!R$35,IF(AND($A$3=List!$A$15,Status!$R$25=0),Data!R$35,NA())))","v":{"$error":"#N/A"}},{"$f":"IF(Data!S$35=\"\",NA(),IF(AND($A$3=List!$A$14,Status!$Q$25=0),Data!S$35,IF(AND($A$3=List!$A$15,Status!$R$25=0),Data!S$35,NA())))","v":{"$error":"#N/A"}}]
[null,"Green",{"$f":"IF(Data!H$35=\"\",0,IF(AND($A$3=List!$A$14,Status!$Q$25=1),Data!H$35,IF(AND($A$3=List!$A$15,Status!$R$25=1),Data!H$35,0)))","v":0},{"$f":"IF(Data!I$35=\"\",NA(),IF(AND($A$3=List!$A$14,Status!$Q$25=1),Data!I$35,IF(AND($A$3=List!$A$15,Status!$R$25=1),Data!I$35,NA())))","v":{"$error":"#N/A"}},{"$f":"IF(Data!J$35=\"\",NA(),IF(AND($A$3=List!$A$14,Status!$Q$25=1),Data!J$35,IF(AND($A$3=List!$A$15,Status!$R$25=1),Data!J$35,NA())))","v":{"$error":"#N/A"}},{"$f":"IF(Data!K$35=\"\",NA(),IF(AND($A$3=List!$A$14,Status!$Q$25=1),Data!K$35,IF(AND($A$3=List!$A$15,Status!$R$25=1),Data!K$35,NA())))","v":{"$error":"#N/A"}},{"$f":"IF(Data!L$35=\"\",NA(),IF(AND($A$3=List!$A$14,Status!$Q$25=1),Data!L$35,IF(AND($A$3=List!$A$15,Status!$R$25=1),Data!L$35,NA())))","v":{"$error":"#N/A"}},{"$f":"IF(Data!M$35=\"\",NA(),IF(AND($A$3=List!$A$14,Status!$Q$25=1),Data!M$35,IF(AND($A$3=List!$A$15,Status!$R$25=1),Data!M$35,NA())))","v":{"$error":"#N/A"}},{"$f":"IF(Data!N$35=\"\",NA(),IF(AND($A$3=List!$A$14,Status!$Q$25=1),Data!N$35,IF(AND($A$3=List!$A$15,Status!$R$25=1),Data!N$35,NA())))","v":{"$error":"#N/A"}},{"$f":"IF(Data!O$35=\"\",NA(),IF(AND($A$3=List!$A$14,Status!$Q$25=1),Data!O$35,IF(AND($A$3=List!$A$15,Status!$R$25=1),Data!O$35,NA())))","v":{"$error":"#N/A"}},{"$f":"IF(Data!P$35=\"\",NA(),IF(AND($A$3=List!$A$14,Status!$Q$25=1),Data!P$35,IF(AND($A$3=List!$A$15,Status!$R$25=1),Data!P$35,NA())))","v":{"$error":"#N/A"}},{"$f":"IF(Data!Q$35=\"\",NA(),IF(AND($A$3=List!$A$14,Status!$Q$25=1),Data!Q$35,IF(AND($A$3=List!$A$15,Status!$R$25=1),Data!Q$35,NA())))","v":{"$error":"#N/A"}},{"$f":"IF(Data!R$35=\"\",NA(),IF(AND($A$3=List!$A$14,Status!$Q$25=1),Data!R$35,IF(AND($A$3=List!$A$15,Status!$R$25=1),Data!R$35,NA())))","v":{"$error":"#N/A"}},{"$f":"IF(Data!S$35=\"\",NA(),IF(AND($A$3=List!$A$14,Status!$Q$25=1),Data!S$35,IF(AND($A$3=List!$A$15,Status!$R$25=1),Data!S$35,NA())))","v":{"$error":"#N/A"}}]
[{"$f":"A43","v":false},{"$f":"B43","v":"Meta"},{"$f":"IF(Data!H36=\"\",0,IF($A$47=FALSE,0,Data!H36))","v":0},{"$f":"IF(Data!I36=\"\",NA(),IF($A$47=FALSE,NA(),Data!I36))","v":{"$error":"#N/A"}},{"$f":"IF(Data!J36=\"\",NA(),IF($A$47=FALSE,NA(),Data!J36))","v":{"$error":"#N/A"}},{"$f":"IF(Data!K36=\"\",NA(),IF($A$47=FALSE,NA(),Data!K36))","v":{"$error":"#N/A"}},{"$f":"IF(Data!L36=\"\",NA(),IF($A$47=FALSE,NA(),Data!L36))","v":{"$error":"#N/A"}},{"$f":"IF(Data!M36=\"\",NA(),IF($A$47=FALSE,NA(),Data!M36))","v":{"$error":"#N/A"}},{"$f":"IF(Data!N36=\"\",NA(),IF($A$47=FALSE,NA(),Data!N36))","v":{"$error":"#N/A"}},{"$f":"IF(Data!O36=\"\",NA(),IF($A$47=FALSE,NA(),Data!O36))","v":{"$error":"#N/A"}},{"$f":"IF(Data!P36=\"\",NA(),IF($A$47=FALSE,NA(),Data!P36))","v":{"$error":"#N/A"}},{"$f":"IF(Data!Q36=\"\",NA(),IF($A$47=FALSE,NA(),Data!Q36))","v":{"$error":"#N/A"}},{"$f":"IF(Data!R36=\"\",NA(),IF($A$47=FALSE,NA(),Data!R36))","v":{"$error":"#N/A"}},{"$f":"IF(Data!S36=\"\",NA(),IF($A$47=FALSE,NA(),Data!S36))","v":{"$error":"#N/A"}}]
[null,"Red",{"$f":"IF(Data!H$38=\"\",0,IF(AND($A$3=List!$A$14,Status!$Q$27=-1),Data!H$38,IF(AND($A$3=List!$A$15,Status!$R$27=-1),Data!H$38,0)))","v":0},{"$f":"IF(Data!I$38=\"\",NA(),IF(AND($A$3=List!$A$14,Status!$Q$27=-1),Data!I$38,IF(AND($A$3=List!$A$15,Status!$R$27=-1),Data!I$38,NA())))","v":{"$error":"#N/A"}},{"$f":"IF(Data!J$38=\"\",NA(),IF(AND($A$3=List!$A$14,Status!$Q$27=-1),Data!J$38,IF(AND($A$3=List!$A$15,Status!$R$27=-1),Data!J$38,NA())))","v":{"$error":"#N/A"}},{"$f":"IF(Data!K$38=\"\",NA(),IF(AND($A$3=List!$A$14,Status!$Q$27=-1),Data!K$38,IF(AND($A$3=List!$A$15,Status!$R$27=-1),Data!K$38,NA())))","v":{"$error":"#N/A"}},{"$f":"IF(Data!L$38=\"\",NA(),IF(AND($A$3=List!$A$14,Status!$Q$27=-1),Data!L$38,IF(AND($A$3=List!$A$15,Status!$R$27=-1),Data!L$38,NA())))","v":{"$error":"#N/A"}},{"$f":"IF(Data!M$38=\"\",NA(),IF(AND($A$3=List!$A$14,Status!$Q$27=-1),Data!M$38,IF(AND($A$3=List!$A$15,Status!$R$27=-1),Data!M$38,NA())))","v":{"$error":"#N/A"}},{"$f":"IF(Data!N$38=\"\",NA(),IF(AND($A$3=List!$A$14,Status!$Q$27=-1),Data!N$38,IF(AND($A$3=List!$A$15,Status!$R$27=-1),Data!N$38,NA())))","v":{"$error":"#N/A"}},{"$f":"IF(Data!O$38=\"\",NA(),IF(AND($A$3=List!$A$14,Status!$Q$27=-1),Data!O$38,IF(AND($A$3=List!$A$15,Status!$R$27=-1),Data!O$38,NA())))","v":{"$error":"#N/A"}},{"$f":"IF(Data!P$38=\"\",NA(),IF(AND($A$3=List!$A$14,Status!$Q$27=-1),Data!P$38,IF(AND($A$3=List!$A$15,Status!$R$27=-1),Data!P$38,NA())))","v":{"$error":"#N/A"}},{"$f":"IF(Data!Q$38=\"\",NA(),IF(AND($A$3=List!$A$14,Status!$Q$27=-1),Data!Q$38,IF(AND($A$3=List!$A$15,Status!$R$27=-1),Data!Q$38,NA())))","v":{"$error":"#N/A"}},{"$f":"IF(Data!R$38=\"\",NA(),IF(AND($A$3=List!$A$14,Status!$Q$27=-1),Data!R$38,IF(AND($A$3=List!$A$15,Status!$R$27=-1),Data!R$38,NA())))","v":{"$error":"#N/A"}},{"$f":"IF(Data!S$38=\"\",NA(),IF(AND($A$3=List!$A$14,Status!$Q$27=-1),Data!S$38,IF(AND($A$3=List!$A$15,Status!$R$27=-1),Data!S$38,NA())))","v":{"$error":"#N/A"}}]
[null,"Yellow",{"$f":"IF(Data!H$38=\"\",0,IF(AND($A$3=List!$A$14,Status!$Q$27=0),Data!H$38,IF(AND($A$3=List!$A$15,Status!$R$27=0),Data!H$38,0)))","v":0},{"$f":"IF(Data!I$38=\"\",NA(),IF(AND($A$3=List!$A$14,Status!$Q$27=0),Data!I$38,IF(AND($A$3=List!$A$15,Status!$R$27=0),Data!I$38,NA())))","v":{"$error":"#N/A"}},{"$f":"IF(Data!J$38=\"\",NA(),IF(AND($A$3=List!$A$14,Status!$Q$27=0),Data!J$38,IF(AND($A$3=List!$A$15,Status!$R$27=0),Data!J$38,NA())))","v":{"$error":"#N/A"}},{"$f":"IF(Data!K$38=\"\",NA(),IF(AND($A$3=List!$A$14,Status!$Q$27=0),Data!K$38,IF(AND($A$3=List!$A$15,Status!$R$27=0),Data!K$38,NA())))","v":{"$error":"#N/A"}},{"$f":"IF(Data!L$38=\"\",NA(),IF(AND($A$3=List!$A$14,Status!$Q$27=0),Data!L$38,IF(AND($A$3=List!$A$15,Status!$R$27=0),Data!L$38,NA())))","v":{"$error":"#N/A"}},{"$f":"IF(Data!M$38=\"\",NA(),IF(AND($A$3=List!$A$14,Status!$Q$27=0),Data!M$38,IF(AND($A$3=List!$A$15,Status!$R$27=0),Data!M$38,NA())))","v":{"$error":"#N/A"}},{"$f":"IF(Data!N$38=\"\",NA(),IF(AND($A$3=List!$A$14,Status!$Q$27=0),Data!N$38,IF(AND($A$3=List!$A$15,Status!$R$27=0),Data!N$38,NA())))","v":{"$error":"#N/A"}},{"$f":"IF(Data!O$38=\"\",NA(),IF(AND($A$3=List!$A$14,Status!$Q$27=0),Data!O$38,IF(AND($A$3=List!$A$15,Status!$R$27=0),Data!O$38,NA())))","v":{"$error":"#N/A"}},{"$f":"IF(Data!P$38=\"\",NA(),IF(AND($A$3=List!$A$14,Status!$Q$27=0),Data!P$38,IF(AND($A$3=List!$A$15,Status!$R$27=0),Data!P$38,NA())))","v":{"$error":"#N/A"}},{"$f":"IF(Data!Q$38=\"\",NA(),IF(AND($A$3=List!$A$14,Status!$Q$27=0),Data!Q$38,IF(AND($A$3=List!$A$15,Status!$R$27=0),Data!Q$38,NA())))","v":{"$error":"#N/A"}},{"$f":"IF(Data!R$38=\"\",NA(),IF(AND($A$3=List!$A$14,Status!$Q$27=0),Data!R$38,IF(AND($A$3=List!$A$15,Status!$R$27=0),Data!R$38,NA())))","v":{"$error":"#N/A"}},{"$f":"IF(Data!S$38=\"\",NA(),IF(AND($A$3=List!$A$14,Status!$Q$27=0),Data!S$38,IF(AND($A$3=List!$A$15,Status!$R$27=0),Data!S$38,NA())))","v":{"$error":"#N/A"}}]
[null,"Green",{"$f":"IF(Data!H$38=\"\",0,IF(AND($A$3=List!$A$14,Status!$Q$27=1),Data!H$38,IF(AND($A$3=List!$A$15,Status!$R$27=1),Data!H$38,0)))","v":0},{"$f":"IF(Data!I$38=\"\",NA(),IF(AND($A$3=List!$A$14,Status!$Q$27=1),Data!I$38,IF(AND($A$3=List!$A$15,Status!$R$27=1),Data!I$38,NA())))","v":{"$error":"#N/A"}},{"$f":"IF(Data!J$38=\"\",NA(),IF(AND($A$3=List!$A$14,Status!$Q$27=1),Data!J$38,IF(AND($A$3=List!$A$15,Status!$R$27=1),Data!J$38,NA())))","v":{"$error":"#N/A"}},{"$f":"IF(Data!K$38=\"\",NA(),IF(AND($A$3=List!$A$14,Status!$Q$27=1),Data!K$38,IF(AND($A$3=List!$A$15,Status!$R$27=1),Data!K$38,NA())))","v":{"$error":"#N/A"}},{"$f":"IF(Data!L$38=\"\",NA(),IF(AND($A$3=List!$A$14,Status!$Q$27=1),Data!L$38,IF(AND($A$3=List!$A$15,Status!$R$27=1),Data!L$38,NA())))","v":{"$error":"#N/A"}},{"$f":"IF(Data!M$38=\"\",NA(),IF(AND($A$3=List!$A$14,Status!$Q$27=1),Data!M$38,IF(AND($A$3=List!$A$15,Status!$R$27=1),Data!M$38,NA())))","v":{"$error":"#N/A"}},{"$f":"IF(Data!N$38=\"\",NA(),IF(AND($A$3=List!$A$14,Status!$Q$27=1),Data!N$38,IF(AND($A$3=List!$A$15,Status!$R$27=1),Data!N$38,NA())))","v":{"$error":"#N/A"}},{"$f":"IF(Data!O$38=\"\",NA(),IF(AND($A$3=List!$A$14,Status!$Q$27=1),Data!O$38,IF(AND($A$3=List!$A$15,Status!$R$27=1),Data!O$38,NA())))","v":{"$error":"#N/A"}},{"$f":"IF(Data!P$38=\"\",NA(),IF(AND($A$3=List!$A$14,Status!$Q$27=1),Data!P$38,IF(AND($A$3=List!$A$15,Status!$R$27=1),Data!P$38,NA())))","v":{"$error":"#N/A"}},{"$f":"IF(Data!Q$38=\"\",NA(),IF(AND($A$3=List!$A$14,Status!$Q$27=1),Data!Q$38,IF(AND($A$3=List!$A$15,Status!$R$27=1),Data!Q$38,NA())))","v":{"$error":"#N/A"}},{"$f":"IF(Data!R$38=\"\",NA(),IF(AND($A$3=List!$A$14,Status!$Q$27=1),Data!R$38,IF(AND($A$3=List!$A$15,Status!$R$27=1),Data!R$38,NA())))","v":{"$error":"#N/A"}},{"$f":"IF(Data!S$38=\"\",NA(),IF(AND($A$3=List!$A$14,Status!$Q$27=1),Data!S$38,IF(AND($A$3=List!$A$15,Status!$R$27=1),Data!S$38,NA())))","v":{"$error":"#N/A"}}]
[{"$f":"A47","v":false},{"$f":"B47","v":"Meta"},{"$f":"IF(Data!H39=\"\",0,IF($A$51=FALSE,0,Data!H39))","v":0},{"$f":"IF(Data!I39=\"\",NA(),IF($A$51=FALSE,NA(),Data!I39))","v":{"$error":"#N/A"}},{"$f":"IF(Data!J39=\"\",NA(),IF($A$51=FALSE,NA(),Data!J39))","v":{"$error":"#N/A"}},{"$f":"IF(Data!K39=\"\",NA(),IF($A$51=FALSE,NA(),Data!K39))","v":{"$error":"#N/A"}},{"$f":"IF(Data!L39=\"\",NA(),IF($A$51=FALSE,NA(),Data!L39))","v":{"$error":"#N/A"}},{"$f":"IF(Data!M39=\"\",NA(),IF($A$51=FALSE,NA(),Data!M39))","v":{"$error":"#N/A"}},{"$f":"IF(Data!N39=\"\",NA(),IF($A$51=FALSE,NA(),Data!N39))","v":{"$error":"#N/A"}},{"$f":"IF(Data!O39=\"\",NA(),IF($A$51=FALSE,NA(),Data!O39))","v":{"$error":"#N/A"}},{"$f":"IF(Data!P39=\"\",NA(),IF($A$51=FALSE,NA(),Data!P39))","v":{"$error":"#N/A"}},{"$f":"IF(Data!Q39=\"\",NA(),IF($A$51=FALSE,NA(),Data!Q39))","v":{"$error":"#N/A"}},{"$f":"IF(Data!R39=\"\",NA(),IF($A$51=FALSE,NA(),Data!R39))","v":{"$error":"#N/A"}},{"$f":"IF(Data!S39=\"\",NA(),IF($A$51=FALSE,NA(),Data!S39))","v":{"$error":"#N/A"}}]

{"sheet":"Aux 2","index":8,"n_rows":51,"n_cols":14,"rows_kept":51,"cut":false,"hidden":false,"merged":[]}
[]
[]
[{"$f":"Dashboard!D4","v":"TOTAL"},{"$f":"Indicators!C4","v":0},{"$f":"Data!H4","v":"ENE"},{"$f":"Data!I4","v":"FEB"},{"$f":"Data!J4","v":"MAR"},{"$f":"Data!K4","v":"ABR"},{"$f":"Data!L4","v":"MAY"},{"$f":"Data!M4","v":"JUN"},{"$f":"Data!N4","v":"JUL"},{"$f":"Data!O4","v":"AGO"},{"$f":"Data!P4","v":"SEP"},{"$f":"Data!Q4","v":"OCT"},{"$f":"Data!R4","v":"NOV"},{"$f":"Data!S4","v":"DIC"}]
[null,"Red",{"$f":"IF(Status!D$5=-1,Data!H5,NA())","v":{"$error":"#N/A"}},{"$f":"IF(Status!E$5=-1,Data!I5,NA())","v":0.03},{"$f":"IF(Status!F$5=-1,Data!J5,NA())","v":0.13},{"$f":"IF(Status!G$5=-1,Data!K5,NA())","v":0.11},{"$f":"IF(Status!H$5=-1,Data!L5,NA())","v":{"$error":"#N/A"}},{"$f":"IF(Status!I$5=-1,Data!M5,NA())","v":0.1},{"$f":"IF(Status!J$5=-1,Data!N5,NA())","v":0.1},{"$f":"IF(Status!K$5=-1,Data!O5,NA())","v":0.06},{"$f":"IF(Status!L$5=-1,Data!P5,NA())","v":{"$error":"#N/A"}},{"$f":"IF(Status!M$5=-1,Data!Q5,NA())","v":{"$error":"#N/A"}},{"$f":"IF(Status!N$5=-1,Data!R5,NA())","v":{"$error":"#N/A"}},{"$f":"IF(Status!O$5=-1,Data!S5,NA())","v":{"$error":"#N/A"}}]
[null,"Yellow",{"$f":"IF(Status!D$5=0,Data!H5,NA())","v":0.16},{"$f":"IF(Status!E$5=0,Data!I5,NA())","v":{"$error":"#N/A"}},{"$f":"IF(Status!F$5=0,Data!J5,NA())","v":{"$error":"#N/A"}},{"$f":"IF(Status!G$5=0,Data!K5,NA())","v":{"$error":"#N/A"}},{"$f":"IF(Status!H$5=0,Data!L5,NA())","v":{"$error":"#N/A"}},{"$f":"IF(Status!I$5=0,Data!M5,NA())","v":{"$error":"#N/A"}},{"$f":"IF(Status!J$5=0,Data!N5,NA())","v":{"$error":"#N/A"}},{"$f":"IF(Status!K$5=0,Data!O5,NA())","v":{"$error":"#N/A"}},{"$f":"IF(Status!L$5=0,Data!P5,NA())","v":{"$error":"#N/A"}},{"$f":"IF(Status!M$5=0,Data!Q5,NA())","v":{"$error":"#N/A"}},{"$f":"IF(Status!N$5=0,Data!R5,NA())","v":{"$error":"#N/A"}},{"$f":"IF(Status!O$5=0,Data!S5,NA())","v":{"$error":"#N/A"}}]
[null,"Green",{"$f":"IF(Status!D$5=1,Data!H5,NA())","v":{"$error":"#N/A"}},{"$f":"IF(Status!E$5=1,Data!I5,NA())","v":{"$error":"#N/A"}},{"$f":"IF(Status!F$5=1,Data!J5,NA())","v":{"$error":"#N/A"}},{"$f":"IF(Status!G$5=1,Data!K5,NA())","v":{"$error":"#N/A"}},{"$f":"IF(Status!H$5=1,Data!L5,NA())","v":0.25},{"$f":"IF(Status!I$5=1,Data!M5,NA())","v":{"$error":"#N/A"}},{"$f":"IF(Status!J$5=1,Data!N5,NA())","v":{"$error":"#N/A"}},{"$f":"IF(Status!K$5=1,Data!O5,NA())","v":{"$error":"#N/A"}},{"$f":"IF(Status!L$5=1,Data!P5,NA())","v":{"$error":"#N/A"}},{"$f":"IF(Status!M$5=1,Data!Q5,NA())","v":{"$error":"#N/A"}},{"$f":"IF(Status!N$5=1,Data!R5,NA())","v":{"$error":"#N/A"}},{"$f":"IF(Status!O$5=1,Data!S5,NA())","v":{"$error":"#N/A"}}]
[null,{"$f":"Data!G6","v":"Meta"},{"$f":"IF(Data!$D$5=\"\",NA(),IF(Data!H6=\"\",NA(),Data!H6))","v":0.2},{"$f":"IF(Data!$D$5=\"\",NA(),IF(Data!I6=\"\",NA(),Data!I6))","v":0.2},{"$f":"IF(Data!$D$5=\"\",NA(),IF(Data!J6=\"\",NA(),Data!J6))","v":0.2},{"$f":"IF(Data!$D$5=\"\",NA(),IF(Data!K6=\"\",NA(),Data!K6))","v":0.2},{"$f":"IF(Data!$D$5=\"\",NA(),IF(Data!L6=\"\",NA(),Data!L6))","v":0.2},{"$f":"IF(Data!$D$5=\"\",NA(),IF(Data!M6=\"\",NA(),Data!M6))","v":0.2},{"$f":"IF(Data!$D$5=\"\",NA(),IF(Data!N6=\"\",NA(),Data!N6))","v":0.2},{"$f":"IF(Data!$D$5=\"\",NA(),IF(Data!O6=\"\",NA(),Data!O6))","v":0.2},{"$f":"IF(Data!$D$5=\"\",NA(),IF(Data!P6=\"\",NA(),Data!P6))","v":0.2},{"$f":"IF(Data!$D$5=\"\",NA(),IF(Data!Q6=\"\",NA(),Data!Q6))","v":0.2},{"$f":"IF(Data!$D$5=\"\",NA(),IF(Data!R6=\"\",NA(),Data!R6))","v":0.2},{"$f":"IF(Data!$D$5=\"\",NA(),IF(Data!S6=\"\",NA(),Data!S6))","v":0.2}]
[null,"Red",{"$f":"IF(Status!D$7=-1,Data!H8,NA())","v":{"$error":"#N/A"}},{"$f":"IF(Status!E$7=-1,Data!I8,NA())","v":{"$error":"#N/A"}},{"$f":"IF(Status!F$7=-1,Data!J8,NA())","v":{"$error":"#N/A"}},{"$f":"IF(Status!G$7=-1,Data!K8,NA())","v":{"$error":"#N/A"}},{"$f":"IF(Status!H$7=-1,Data!L8,NA())","v":{"$error":"#N/A"}},{"$f":"IF(Status!I$7=-1,Data!M8,NA())","v":{"$error":"#N/A"}},{"$f":"IF(Status!J$7=-1,Data!N8,NA())","v":{"$error":"#N/A"}},{"$f":"IF(Status!K$7=-1,Data!O8,NA())","v":{"$error":"#N/A"}},{"$f":"IF(Status!L$7=-1,Data!P8,NA())","v":{"$error":"#N/A"}},{"$f":"IF(Status!M$7=-1,Data!Q8,NA())","v":{"$error":"#N/A"}},{"$f":"IF(Status!N$7=-1,Data!R8,NA())","v":{"$error":"#N/A"}},{"$f":"IF(Status!O$7=-1,Data!S8,NA())","v":{"$error":"#N/A"}}]
[null,"Yellow",{"$f":"IF(Status!D$7=0,Data!H8,NA())","v":{"$error":"#N/A"}},{"$f":"IF(Status!E$7=0,Data!I8,NA())","v":{"$error":"#N/A"}},{"$f":"IF(Status!F$7=0,Data!J8,NA())","v":{"$error":"#N/A"}},{"$f":"IF(Status!G$7=0,Data!K8,NA())","v":{"$error":"#N/A"}},{"$f":"IF(Status!H$7=0,Data!L8,NA())","v":{"$error":"#N/A"}},{"$f":"IF(Status!I$7=0,Data!M8,NA())","v":{"$error":"#N/A"}},{"$f":"IF(Status!J$7=0,Data!N8,NA())","v":{"$error":"#N/A"}},{"$f":"IF(Status!K$7=0,Data!O8,NA())","v":{"$error":"#N/A"}},{"$f":"IF(Status!L$7=0,Data!P8,NA())","v":{"$error":"#N/A"}},{"$f":"IF(Status!M$7=0,Data!Q8,NA())","v":{"$error":"#N/A"}},{"$f":"IF(Status!N$7=0,Data!R8,NA())","v":{"$error":"#N/A"}},{"$f":"IF(Status!O$7=0,Data!S8,NA())","v":{"$error":"#N/A"}}]
[null,"Green",{"$f":"IF(Status!D$7=1,Data!H8,NA())","v":{"$error":"#N/A"}},{"$f":"IF(Status!E$7=1,Data!I8,NA())","v":{"$error":"#N/A"}},{"$f":"IF(Status!F$7=1,Data!J8,NA())","v":{"$error":"#N/A"}},{"$f":"IF(Status!G$7=1,Data!K8,NA())","v":{"$error":"#N/A"}},{"$f":"IF(Status!H$7=1,Data!L8,NA())","v":{"$error":"#N/A"}},{"$f":"IF(Status!I$7=1,Data!M8,NA())","v":{"$error":"#N/A"}},{"$f":"IF(Status!J$7=1,Data!N8,NA())","v":{"$error":"#N/A"}},{"$f":"IF(Status!K$7=1,Data!O8,NA())","v":{"$error":"#N/A"}},{"$f":"IF(Status!L$7=1,Data!P8,NA())","v":{"$error":"#N/A"}},{"$f":"IF(Status!M$7=1,Data!Q8,NA())","v":{"$error":"#N/A"}},{"$f":"IF(Status!N$7=1,Data!R8,NA())","v":{"$error":"#N/A"}},{"$f":"IF(Status!O$7=1,Data!S8,NA())","v":{"$error":"#N/A"}}]
[null,{"$f":"B7","v":"Meta"},{"$f":"IF(Data!$D$8=\"\",NA(),IF(Data!H9=\"\",NA(),Data!H9))","v":{"$error":"#N/A"}},{"$f":"IF(Data!$D$8=\"\",NA(),IF(Data!I9=\"\",NA(),Data!I9))","v":{"$error":"#N/A"}},{"$f":"IF(Data!$D$8=\"\",NA(),IF(Data!J9=\"\",NA(),Data!J9))","v":{"$error":"#N/A"}},{"$f":"IF(Data!$D$8=\"\",NA(),IF(Data!K9=\"\",NA(),Data!K9))","v":{"$error":"#N/A"}},{"$f":"IF(Data!$D$8=\"\",NA(),IF(Data!L9=\"\",NA(),Data!L9))","v":{"$error":"#N/A"}},{"$f":"IF(Data!$D$8=\"\",NA(),IF(Data!M9=\"\",NA(),Data!M9))","v":{"$error":"#N/A"}},{"$f":"IF(Data!$D$8=\"\",NA(),IF(Data!N9=\"\",NA(),Data!N9))","v":{"$error":"#N/A"}},{"$f":"IF(Data!$D$8=\"\",NA(),IF(Data!O9=\"\",NA(),Data!O9))","v":{"$error":"#N/A"}},{"$f":"IF(Data!$D$8=\"\",NA(),IF(Data!P9=\"\",NA(),Data!P9))","v":{"$error":"#N/A"}},{"$f":"IF(Data!$D$8=\"\",NA(),IF(Data!Q9=\"\",NA(),Data!Q9))","v":{"$error":"#N/A"}},{"$f":"IF(Data!$D$8=\"\",NA(),IF(Data!R9=\"\",NA(),Data!R9))","v":{"$error":"#N/A"}},{"$f":"IF(Data!$D$8=\"\",NA(),IF(Data!S9=\"\",NA(),Data!S9))","v":{"$error":"#N/A"}}]
[null,"Red",{"$f":"IF(Status!D$9=-1,Data!H11,NA())","v":{"$error":"#N/A"}},{"$f":"IF(Status!E$9=-1,Data!I11,NA())","v":{"$error":"#N/A"}},{"$f":"IF(Status!F$9=-1,Data!J11,NA())","v":{"$error":"#N/A"}},{"$f":"IF(Status!G$9=-1,Data!K11,NA())","v":{"$error":"#N/A"}},{"$f":"IF(Status!H$9=-1,Data!L11,NA())","v":{"$error":"#N/A"}},{"$f":"IF(Status!I$9=-1,Data!M11,NA())","v":{"$error":"#N/A"}},{"$f":"IF(Status!J$9=-1,Data!N11,NA())","v":{"$error":"#N/A"}},{"$f":"IF(Status!K$9=-1,Data!O11,NA())","v":{"$error":"#N/A"}},{"$f":"IF(Status!L$9=-1,Data!P11,NA())","v":{"$error":"#N/A"}},{"$f":"IF(Status!M$9=-1,Data!Q11,NA())","v":{"$error":"#N/A"}},{"$f":"IF(Status!N$9=-1,Data!R11,NA())","v":{"$error":"#N/A"}},{"$f":"IF(Status!O$9=-1,Data!S11,NA())","v":{"$error":"#N/A"}}]
[null,"Yellow",{"$f":"IF(Status!D$9=0,Data!H11,NA())","v":{"$error":"#N/A"}},{"$f":"IF(Status!E$9=0,Data!I11,NA())","v":{"$error":"#N/A"}},{"$f":"IF(Status!F$9=0,Data!J11,NA())","v":{"$error":"#N/A"}},{"$f":"IF(Status!G$9=0,Data!K11,NA())","v":{"$error":"#N/A"}},{"$f":"IF(Status!H$9=0,Data!L11,NA())","v":{"$error":"#N/A"}},{"$f":"IF(Status!I$9=0,Data!M11,NA())","v":{"$error":"#N/A"}},{"$f":"IF(Status!J$9=0,Data!N11,NA())","v":{"$error":"#N/A"}},{"$f":"IF(Status!K$9=0,Data!O11,NA())","v":{"$error":"#N/A"}},{"$f":"IF(Status!L$9=0,Data!P11,NA())","v":{"$error":"#N/A"}},{"$f":"IF(Status!M$9=0,Data!Q11,NA())","v":{"$error":"#N/A"}},{"$f":"IF(Status!N$9=0,Data!R11,NA())","v":{"$error":"#N/A"}},{"$f":"IF(Status!O$9=0,Data!S11,NA())","v":{"$error":"#N/A"}}]
[null,"Green",{"$f":"IF(Status!D$9=1,Data!H11,NA())","v":{"$error":"#N/A"}},{"$f":"IF(Status!E$9=1,Data!I11,NA())","v":{"$error":"#N/A"}},{"$f":"IF(Status!F$9=1,Data!J11,NA())","v":{"$error":"#N/A"}},{"$f":"IF(Status!G$9=1,Data!K11,NA())","v":{"$error":"#N/A"}},{"$f":"IF(Status!H$9=1,Data!L11,NA())","v":{"$error":"#N/A"}},{"$f":"IF(Status!I$9=1,Data!M11,NA())","v":{"$error":"#N/A"}},{"$f":"IF(Status!J$9=1,Data!N11,NA())","v":{"$error":"#N/A"}},{"$f":"IF(Status!K$9=1,Data!O11,NA())","v":{"$error":"#N/A"}},{"$f":"IF(Status!L$9=1,Data!P11,NA())","v":{"$error":"#N/A"}},{"$f":"IF(Status!M$9=1,Data!Q11,NA())","v":{"$error":"#N/A"}},{"$f":"IF(Status!N$9=1,Data!R11,NA())","v":{"$error":"#N/A"}},{"$f":"IF(Status!O$9=1,Data!S11,NA())","v":{"$error":"#N/A"}}]
[null,{"$f":"B11","v":"Meta"},{"$f":"IF(Data!$D$11=\"\",NA(),IF(Data!H12=\"\",NA(),Data!H12))","v":{"$error":"#N/A"}},{"$f":"IF(Data!$D$11=\"\",NA(),IF(Data!I12=\"\",NA(),Data!I12))","v":{"$error":"#N/A"}},{"$f":"IF(Data!$D$11=\"\",NA(),IF(Data!J12=\"\",NA(),Data!J12))","v":{"$error":"#N/A"}},{"$f":"IF(Data!$D$11=\"\",NA(),IF(Data!K12=\"\",NA(),Data!K12))","v":{"$error":"#N/A"}},{"$f":"IF(Data!$D$11=\"\",NA(),IF(Data!L12=\"\",NA(),Data!L12))","v":{"$error":"#N/A"}},{"$f":"IF(Data!$D$11=\"\",NA(),IF(Data!M12=\"\",NA(),Data!M12))","v":{"$error":"#N/A"}},{"$f":"IF(Data!$D$11=\"\",NA(),IF(Data!N12=\"\",NA(),Data!N12))","v":{"$error":"#N/A"}},{"$f":"IF(Data!$D$11=\"\",NA(),IF(Data!O12=\"\",NA(),Data!O12))","v":{"$error":"#N/A"}},{"$f":"IF(Data!$D$11=\"\",NA(),IF(Data!P12=\"\",NA(),Data!P12))","v":{"$error":"#N/A"}},{"$f":"IF(Data!$D$11=\"\",NA(),IF(Data!Q12=\"\",NA(),Data!Q12))","v":{"$error":"#N/A"}},{"$f":"IF(Data!$D$11=\"\",NA(),IF(Data!R12=\"\",NA(),Data!R12))","v":{"$error":"#N/A"}},{"$f":"IF(Data!$D$11=\"\",NA(),IF(Data!S12=\"\",NA(),Data!S12))","v":{"$error":"#N/A"}}]
[null,"Red",{"$f":"IF(Status!D$11=-1,Data!H14,NA())","v":{"$error":"#N/A"}},{"$f":"IF(Status!E$11=-1,Data!I14,NA())","v":{"$error":"#N/A"}},{"$f":"IF(Status!F$11=-1,Data!J14,NA())","v":1},{"$f":"IF(Status!G$11=-1,Data!K14,NA())","v":{"$error":"#N/A"}},{"$f":"IF(Status!H$11=-1,Data!L14,NA())","v":{"$error":"#N/A"}},{"$f":"IF(Status!I$11=-1,Data!M14,NA())","v":{"$error":"#N/A"}},{"$f":"IF(Status!J$11=-1,Data!N14,NA())","v":{"$error":"#N/A"}},{"$f":"IF(Status!K$11=-1,Data!O14,NA())","v":{"$error":"#N/A"}},{"$f":"IF(Status!L$11=-1,Data!P14,NA())","v":{"$error":"#N/A"}},{"$f":"IF(Status!M$11=-1,Data!Q14,NA())","v":{"$error":"#N/A"}},{"$f":"IF(Status!N$11=-1,Data!R14,NA())","v":{"$error":"#N/A"}},{"$f":"IF(Status!O$11=-1,Data!S14,NA())","v":{"$error":"#N/A"}}]
[null,"Yellow",{"$f":"IF(Status!D$11=0,Data!H14,NA())","v":{"$error":"#N/A"}},{"$f":"IF(Status!E$11=0,Data!I14,NA())","v":{"$error":"#N/A"}},{"$f":"IF(Status!F$11=0,Data!J14,NA())","v":{"$error":"#N/A"}},{"$f":"IF(Status!G$11=0,Data!K14,NA())","v":{"$error":"#N/A"}},{"$f":"IF(Status!H$11=0,Data!L14,NA())","v":{"$error":"#N/A"}},{"$f":"IF(Status!I$11=0,Data!M14,NA())","v":{"$error":"#N/A"}},{"$f":"IF(Status!J$11=0,Data!N14,NA())","v":{"$error":"#N/A"}},{"$f":"IF(Status!K$11=0,Data!O14,NA())","v":{"$error":"#N/A"}},{"$f":"IF(Status!L$11=0,Data!P14,NA())","v":{"$error":"#N/A"}},{"$f":"IF(Status!M$11=0,Data!Q14,NA())","v":{"$error":"#N/A"}},{"$f":"IF(Status!N$11=0,Data!R14,NA())","v":{"$error":"#N/A"}},{"$f":"IF(Status!O$11=0,Data!S14,NA())","v":{"$error":"#N/A"}}]
[null,"Green",{"$f":"IF(Status!D$11=1,Data!H14,NA())","v":1},{"$f":"IF(Status!E$11=1,Data!I14,NA())","v":2},{"$f":"IF(Status!F$11=1,Data!J14,NA())","v":{"$error":"#N/A"}},{"$f":"IF(Status!G$11=1,Data!K14,NA())","v":{"$error":"#N/A"}},{"$f":"IF(Status!H$11=1,Data!L14,NA())","v":{"$error":"#N/A"}},{"$f":"IF(Status!I$11=1,Data!M14,NA())","v":{"$error":"#N/A"}},{"$f":"IF(Status!J$11=1,Data!N14,NA())","v":{"$error":"#N/A"}},{"$f":"IF(Status!K$11=1,Data!O14,NA())","v":{"$error":"#N/A"}},{"$f":"IF(Status!L$11=1,Data!P14,NA())","v":{"$error":"#N/A"}},{"$f":"IF(Status!M$11=1,Data!Q14,NA())","v":{"$error":"#N/A"}},{"$f":"IF(Status!N$11=1,Data!R14,NA())","v":{"$error":"#N/A"}},{"$f":"IF(Status!O$11=1,Data!S14,NA())","v":{"$error":"#N/A"}}]
[null,{"$f":"B15","v":"Meta"},{"$f":"IF(Data!$D$14=\"\",NA(),IF(Data!H15=\"\",NA(),Data!H15))","v":1},{"$f":"IF(Data!$D$14=\"\",NA(),IF(Data!I15=\"\",NA(),Data!I15))","v":2},{"$f":"IF(Data!$D$14=\"\",NA(),IF(Data!J15=\"\",NA(),Data!J15))","v":2},{"$f":"IF(Data!$D$14=\"\",NA(),IF(Data!K15=\"\",NA(),Data!K15))","v":{"$error":"#N/A"}},{"$f":"IF(Data!$D$14=\"\",NA(),IF(Data!L15=\"\",NA(),Data!L15))","v":{"$error":"#N/A"}},{"$f":"IF(Data!$D$14=\"\",NA(),IF(Data!M15=\"\",NA(),Data!M15))","v":{"$error":"#N/A"}},{"$f":"IF(Data!$D$14=\"\",NA(),IF(Data!N15=\"\",NA(),Data!N15))","v":{"$error":"#N/A"}},{"$f":"IF(Data!$D$14=\"\",NA(),IF(Data!O15=\"\",NA(),Data!O15))","v":{"$error":"#N/A"}},{"$f":"IF(Data!$D$14=\"\",NA(),IF(Data!P15=\"\",NA(),Data!P15))","v":{"$error":"#N/A"}},{"$f":"IF(Data!$D$14=\"\",NA(),IF(Data!Q15=\"\",NA(),Data!Q15))","v":{"$error":"#N/A"}},{"$f":"IF(Data!$D$14=\"\",NA(),IF(Data!R15=\"\",NA(),Data!R15))","v":{"$error":"#N/A"}},{"$f":"IF(Data!$D$14=\"\",NA(),IF(Data!S15=\"\",NA(),Data!S15))","v":{"$error":"#N/A"}}]
[null,"Red",{"$f":"IF(Status!D$13=-1,Data!H17,NA())","v":{"$error":"#N/A"}},{"$f":"IF(Status!E$13=-1,Data!I17,NA())","v":{"$error":"#N/A"}},{"$f":"IF(Status!F$13=-1,Data!J17,NA())","v":{"$error":"#N/A"}},{"$f":"IF(Status!G$13=-1,Data!K17,NA())","v":{"$error":"#N/A"}},{"$f":"IF(Status!H$13=-1,Data!L17,NA())","v":{"$error":"#N/A"}},{"$f":"IF(Status!I$13=-1,Data!M17,NA())","v":{"$error":"#N/A"}},{"$f":"IF(Status!J$13=-1,Data!N17,NA())","v":{"$error":"#N/A"}},{"$f":"IF(Status!K$13=-1,Data!O17,NA())","v":{"$error":"#N/A"}},{"$f":"IF(Status!L$13=-1,Data!P17,NA())","v":{"$error":"#N/A"}},{"$f":"IF(Status!M$13=-1,Data!Q17,NA())","v":{"$error":"#N/A"}},{"$f":"IF(Status!N$13=-1,Data!R17,NA())","v":{"$error":"#N/A"}},{"$f":"IF(Status!O$13=-1,Data!S17,NA())","v":{"$error":"#N/A"}}]
[null,"Yellow",{"$f":"IF(Status!D$13=0,Data!H17,NA())","v":{"$error":"#N/A"}},{"$f":"IF(Status!E$13=0,Data!I17,NA())","v":{"$error":"#N/A"}},{"$f":"IF(Status!F$13=0,Data!J17,NA())","v":{"$error":"#N/A"}},{"$f":"IF(Status!G$13=0,Data!K17,NA())","v":{"$error":"#N/A"}},{"$f":"IF(Status!H$13=0,Data!L17,NA())","v":{"$error":"#N/A"}},{"$f":"IF(Status!I$13=0,Data!M17,NA())","v":{"$error":"#N/A"}},{"$f":"IF(Status!J$13=0,Data!N17,NA())","v":{"$error":"#N/A"}},{"$f":"IF(Status!K$13=0,Data!O17,NA())","v":{"$error":"#N/A"}},{"$f":"IF(Status!L$13=0,Data!P17,NA())","v":{"$error":"#N/A"}},{"$f":"IF(Status!M$13=0,Data!Q17,NA())","v":{"$error":"#N/A"}},{"$f":"IF(Status!N$13=0,Data!R17,NA())","v":{"$error":"#N/A"}},{"$f":"IF(Status!O$13=0,Data!S17,NA())","v":{"$error":"#N/A"}}]
[null,"Green",{"$f":"IF(Status!D$13=1,Data!H17,NA())","v":{"$error":"#N/A"}},{"$f":"IF(Status!E$13=1,Data!I17,NA())","v":{"$error":"#N/A"}},{"$f":"IF(Status!F$13=1,Data!J17,NA())","v":{"$error":"#N/A"}},{"$f":"IF(Status!G$13=1,Data!K17,NA())","v":{"$error":"#N/A"}},{"$f":"IF(Status!H$13=1,Data!L17,NA())","v":{"$error":"#N/A"}},{"$f":"IF(Status!I$13=1,Data!M17,NA())","v":{"$error":"#N/A"}},{"$f":"IF(Status!J$13=1,Data!N17,NA())","v":{"$error":"#N/A"}},{"$f":"IF(Status!K$13=1,Data!O17,NA())","v":{"$error":"#N/A"}},{"$f":"IF(Status!L$13=1,Data!P17,NA())","v":{"$error":"#N/A"}},{"$f":"IF(Status!M$13=1,Data!Q17,NA())","v":{"$error":"#N/A"}},{"$f":"IF(Status!N$13=1,Data!R17,NA())","v":{"$error":"#N/A"}},{"$f":"IF(Status!O$13=1,Data!S17,NA())","v":{"$error":"#N/A"}}]
[null,{"$f":"B19","v":"Meta"},{"$f":"IF(Data!$D$17=\"\",NA(),IF(Data!H18=\"\",NA(),Data!H18))","v":{"$error":"#N/A"}},{"$f":"IF(Data!$D$17=\"\",NA(),IF(Data!I18=\"\",NA(),Data!I18))","v":{"$error":"#N/A"}},{"$f":"IF(Data!$D$17=\"\",NA(),IF(Data!J18=\"\",NA(),Data!J18))","v":{"$error":"#N/A"}},{"$f":"IF(Data!$D$17=\"\",NA(),IF(Data!K18=\"\",NA(),Data!K18))","v":{"$error":"#N/A"}},{"$f":"IF(Data!$D$17=\"\",NA(),IF(Data!L18=\"\",NA(),Data!L18))","v":{"$error":"#N/A"}},{"$f":"IF(Data!$D$17=\"\",NA(),IF(Data!M18=\"\",NA(),Data!M18))","v":{"$error":"#N/A"}},{"$f":"IF(Data!$D$17=\"\",NA(),IF(Data!N18=\"\",NA(),Data!N18))","v":{"$error":"#N/A"}},{"$f":"IF(Data!$D$17=\"\",NA(),IF(Data!O18=\"\",NA(),Data!O18))","v":{"$error":"#N/A"}},{"$f":"IF(Data!$D$17=\"\",NA(),IF(Data!P18=\"\",NA(),Data!P18))","v":{"$error":"#N/A"}},{"$f":"IF(Data!$D$17=\"\",NA(),IF(Data!Q18=\"\",NA(),Data!Q18))","v":{"$error":"#N/A"}},{"$f":"IF(Data!$D$17=\"\",NA(),IF(Data!R18=\"\",NA(),Data!R18))","v":{"$error":"#N/A"}},{"$f":"IF(Data!$D$17=\"\",NA(),IF(Data!S18=\"\",NA(),Data!S18))","v":{"$error":"#N/A"}}]
[null,"Red",{"$f":"IF(Status!D$15=-1,Data!H20,NA())","v":{"$error":"#N/A"}},{"$f":"IF(Status!E$15=-1,Data!I20,NA())","v":{"$error":"#N/A"}},{"$f":"IF(Status!F$15=-1,Data!J20,NA())","v":{"$error":"#N/A"}},{"$f":"IF(Status!G$15=-1,Data!K20,NA())","v":{"$error":"#N/A"}},{"$f":"IF(Status!H$15=-1,Data!L20,NA())","v":{"$error":"#N/A"}},{"$f":"IF(Status!I$15=-1,Data!M20,NA())","v":{"$error":"#N/A"}},{"$f":"IF(Status!J$15=-1,Data!N20,NA())","v":{"$error":"#N/A"}},{"$f":"IF(Status!K$15=-1,Data!O20,NA())","v":{"$error":"#N/A"}},{"$f":"IF(Status!L$15=-1,Data!P20,NA())","v":{"$error":"#N/A"}},{"$f":"IF(Status!M$15=-1,Data!Q20,NA())","v":{"$error":"#N/A"}},{"$f":"IF(Status!N$15=-1,Data!R20,NA())","v":{"$error":"#N/A"}},{"$f":"IF(Status!O$15=-1,Data!S20,NA())","v":{"$error":"#N/A"}}]
[null,"Yellow",{"$f":"IF(Status!D$15=0,Data!H20,NA())","v":{"$error":"#N/A"}},{"$f":"IF(Status!E$15=0,Data!I20,NA())","v":{"$error":"#N/A"}},{"$f":"IF(Status!F$15=0,Data!J20,NA())","v":{"$error":"#N/A"}},{"$f":"IF(Status!G$15=0,Data!K20,NA())","v":{"$error":"#N/A"}},{"$f":"IF(Status!H$15=0,Data!L20,NA())","v":{"$error":"#N/A"}},{"$f":"IF(Status!I$15=0,Data!M20,NA())","v":{"$error":"#N/A"}},{"$f":"IF(Status!J$15=0,Data!N20,NA())","v":{"$error":"#N/A"}},{"$f":"IF(Status!K$15=0,Data!O20,NA())","v":{"$error":"#N/A"}},{"$f":"IF(Status!L$15=0,Data!P20,NA())","v":{"$error":"#N/A"}},{"$f":"IF(Status!M$15=0,Data!Q20,NA())","v":{"$error":"#N/A"}},{"$f":"IF(Status!N$15=0,Data!R20,NA())","v":{"$error":"#N/A"}},{"$f":"IF(Status!O$15=0,Data!S20,NA())","v":{"$error":"#N/A"}}]
[null,"Green",{"$f":"IF(Status!D$15=1,Data!H20,NA())","v":{"$error":"#N/A"}},{"$f":"IF(Status!E$15=1,Data!I20,NA())","v":{"$error":"#N/A"}},{"$f":"IF(Status!F$15=1,Data!J20,NA())","v":{"$error":"#N/A"}},{"$f":"IF(Status!G$15=1,Data!K20,NA())","v":{"$error":"#N/A"}},{"$f":"IF(Status!H$15=1,Data!L20,NA())","v":{"$error":"#N/A"}},{"$f":"IF(Status!I$15=1,Data!M20,NA())","v":{"$error":"#N/A"}},{"$f":"IF(Status!J$15=1,Data!N20,NA())","v":{"$error":"#N/A"}},{"$f":"IF(Status!K$15=1,Data!O20,NA())","v":{"$error":"#N/A"}},{"$f":"IF(Status!L$15=1,Data!P20,NA())","v":{"$error":"#N/A"}},{"$f":"IF(Status!M$15=1,Data!Q20,NA())","v":{"$error":"#N/A"}},{"$f":"IF(Status!N$15=1,Data!R20,NA())","v":{"$error":"#N/A"}},{"$f":"IF(Status!O$15=1,Data!S20,NA())","v":{"$error":"#N/A"}}]
[null,{"$f":"B23","v":"Meta"},{"$f":"IF(Data!$D$20=\"\",NA(),IF(Data!H21=\"\",NA(),Data!H21))","v":{"$error":"#N/A"}},{"$f":"IF(Data!$D$20=\"\",NA(),IF(Data!I21=\"\",NA(),Data!I21))","v":{"$error":"#N/A"}},{"$f":"IF(Data!$D$20=\"\",NA(),IF(Data!J21=\"\",NA(),Data!J21))","v":{"$error":"#N/A"}},{"$f":"IF(Data!$D$20=\"\",NA(),IF(Data!K21=\"\",NA(),Data!K21))","v":{"$error":"#N/A"}},{"$f":"IF(Data!$D$20=\"\",NA(),IF(Data!L21=\"\",NA(),Data!L21))","v":{"$error":"#N/A"}},{"$f":"IF(Data!$D$20=\"\",NA(),IF(Data!M21=\"\",NA(),Data!M21))","v":{"$error":"#N/A"}},{"$f":"IF(Data!$D$20=\"\",NA(),IF(Data!N21=\"\",NA(),Data!N21))","v":{"$error":"#N/A"}},{"$f":"IF(Data!$D$20=\"\",NA(),IF(Data!O21=\"\",NA(),Data!O21))","v":{"$error":"#N/A"}},{"$f":"IF(Data!$D$20=\"\",NA(),IF(Data!P21=\"\",NA(),Data!P21))","v":{"$error":"#N/A"}},{"$f":"IF(Data!$D$20=\"\",NA(),IF(Data!Q21=\"\",NA(),Data!Q21))","v":{"$error":"#N/A"}},{"$f":"IF(Data!$D$20=\"\",NA(),IF(Data!R21=\"\",NA(),Data!R21))","v":{"$error":"#N/A"}},{"$f":"IF(Data!$D$20=\"\",NA(),IF(Data!S21=\"\",NA(),Data!S21))","v":{"$error":"#N/A"}}]
[null,"Red",{"$f":"IF(Status!D$17=-1,Data!H23,NA())","v":{"$error":"#N/A"}},{"$f":"IF(Status!E$17=-1,Data!I23,NA())","v":{"$error":"#N/A"}},{"$f":"IF(Status!F$17=-1,Data!J23,NA())","v":{"$error":"#N/A"}},{"$f":"IF(Status!G$17=-1,Data!K23,NA())","v":{"$error":"#N/A"}},{"$f":"IF(Status!H$17=-1,Data!L23,NA())","v":{"$error":"#N/A"}},{"$f":"IF(Status!I$17=-1,Data!M23,NA())","v":{"$error":"#N/A"}},{"$f":"IF(Status!J$17=-1,Data!N23,NA())","v":{"$error":"#N/A"}},{"$f":"IF(Status!K$17=-1,Data!O23,NA())","v":{"$error":"#N/A"}},{"$f":"IF(Status!L$17=-1,Data!P23,NA())","v":{"$error":"#N/A"}},{"$f":"IF(Status!M$17=-1,Data!Q23,NA())","v":{"$error":"#N/A"}},{"$f":"IF(Status!N$17=-1,Data!R23,NA())","v":{"$error":"#N/A"}},{"$f":"IF(Status!O$17=-1,Data!S23,NA())","v":{"$error":"#N/A"}}]
[null,"Yellow",{"$f":"IF(Status!D$17=0,Data!H23,NA())","v":{"$error":"#N/A"}},{"$f":"IF(Status!E$17=0,Data!I23,NA())","v":{"$error":"#N/A"}},{"$f":"IF(Status!F$17=0,Data!J23,NA())","v":{"$error":"#N/A"}},{"$f":"IF(Status!G$17=0,Data!K23,NA())","v":{"$error":"#N/A"}},{"$f":"IF(Status!H$17=0,Data!L23,NA())","v":{"$error":"#N/A"}},{"$f":"IF(Status!I$17=0,Data!M23,NA())","v":{"$error":"#N/A"}},{"$f":"IF(Status!J$17=0,Data!N23,NA())","v":{"$error":"#N/A"}},{"$f":"IF(Status!K$17=0,Data!O23,NA())","v":{"$error":"#N/A"}},{"$f":"IF(Status!L$17=0,Data!P23,NA())","v":{"$error":"#N/A"}},{"$f":"IF(Status!M$17=0,Data!Q23,NA())","v":{"$error":"#N/A"}},{"$f":"IF(Status!N$17=0,Data!R23,NA())","v":{"$error":"#N/A"}},{"$f":"IF(Status!O$17=0,Data!S23,NA())","v":{"$error":"#N/A"}}]
[null,"Green",{"$f":"IF(Status!D$17=1,Data!H23,NA())","v":{"$error":"#N/A"}},{"$f":"IF(Status!E$17=1,Data!I23,NA())","v":{"$error":"#N/A"}},{"$f":"IF(Status!F$17=1,Data!J23,NA())","v":{"$error":"#N/A"}},{"$f":"IF(Status!G$17=1,Data!K23,NA())","v":{"$error":"#N/A"}},{"$f":"IF(Status!H$17=1,Data!L23,NA())","v":{"$error":"#N/A"}},{"$f":"IF(Status!I$17=1,Data!M23,NA())","v":{"$error":"#N/A"}},{"$f":"IF(Status!J$17=1,Data!N23,NA())","v":{"$error":"#N/A"}},{"$f":"IF(Status!K$17=1,Data!O23,NA())","v":{"$error":"#N/A"}},{"$f":"IF(Status!L$17=1,Data!P23,NA())","v":{"$error":"#N/A"}},{"$f":"IF(Status!M$17=1,Data!Q23,NA())","v":{"$error":"#N/A"}},{"$f":"IF(Status!N$17=1,Data!R23,NA())","v":{"$error":"#N/A"}},{"$f":"IF(Status!O$17=1,Data!S23,NA())","v":{"$error":"#N/A"}}]
[null,{"$f":"B27","v":"Meta"},{"$f":"IF(Data!$D$23=\"\",NA(),IF(Data!H24=\"\",NA(),Data!H24))","v":{"$error":"#N/A"}},{"$f":"IF(Data!$D$23=\"\",NA(),IF(Data!I24=\"\",NA(),Data!I24))","v":{"$error":"#N/A"}},{"$f":"IF(Data!$D$23=\"\",NA(),IF(Data!J24=\"\",NA(),Data!J24))","v":{"$error":"#N/A"}},{"$f":"IF(Data!$D$23=\"\",NA(),IF(Data!K24=\"\",NA(),Data!K24))","v":{"$error":"#N/A"}},{"$f":"IF(Data!$D$23=\"\",NA(),IF(Data!L24=\"\",NA(),Data!L24))","v":{"$error":"#N/A"}},{"$f":"IF(Data!$D$23=\"\",NA(),IF(Data!M24=\"\",NA(),Data!M24))","v":{"$error":"#N/A"}},{"$f":"IF(Data!$D$23=\"\",NA(),IF(Data!N24=\"\",NA(),Data!N24))","v":{"$error":"#N/A"}},{"$f":"IF(Data!$D$23=\"\",NA(),IF(Data!O24=\"\",NA(),Data!O24))","v":{"$error":"#N/A"}},{"$f":"IF(Data!$D$23=\"\",NA(),IF(Data!P24=\"\",NA(),Data!P24))","v":{"$error":"#N/A"}},{"$f":"IF(Data!$D$23=\"\",NA(),IF(Data!Q24=\"\",NA(),Data!Q24))","v":{"$error":"#N/A"}},{"$f":"IF(Data!$D$23=\"\",NA(),IF(Data!R24=\"\",NA(),Data!R24))","v":{"$error":"#N/A"}},{"$f":"IF(Data!$D$23=\"\",NA(),IF(Data!S24=\"\",NA(),Data!S24))","v":{"$error":"#N/A"}}]
[null,"Red",{"$f":"IF(Status!D$19=-1,Data!H26,NA())","v":{"$error":"#N/A"}},{"$f":"IF(Status!E$19=-1,Data!I26,NA())","v":{"$error":"#N/A"}},{"$f":"IF(Status!F$19=-1,Data!J26,NA())","v":{"$error":"#N/A"}},{"$f":"IF(Status!G$19=-1,Data!K26,NA())","v":{"$error":"#N/A"}},{"$f":"IF(Status!H$19=-1,Data!L26,NA())","v":{"$error":"#N/A"}},{"$f":"IF(Status!I$19=-1,Data!M26,NA())","v":{"$error":"#N/A"}},{"$f":"IF(Status!J$19=-1,Data!N26,NA())","v":{"$error":"#N/A"}},{"$f":"IF(Status!K$19=-1,Data!O26,NA())","v":{"$error":"#N/A"}},{"$f":"IF(Status!L$19=-1,Data!P26,NA())","v":{"$error":"#N/A"}},{"$f":"IF(Status!M$19=-1,Data!Q26,NA())","v":{"$error":"#N/A"}},{"$f":"IF(Status!N$19=-1,Data!R26,NA())","v":{"$error":"#N/A"}},{"$f":"IF(Status!O$19=-1,Data!S26,NA())","v":{"$error":"#N/A"}}]
[null,"Yellow",{"$f":"IF(Status!D$19=0,Data!H26,NA())","v":15000},{"$f":"IF(Status!E$19=0,Data!I26,NA())","v":15348},{"$f":"IF(Status!F$19=0,Data!J26,NA())","v":{"$error":"#N/A"}},{"$f":"IF(Status!G$19=0,Data!K26,NA())","v":{"$error":"#N/A"}},{"$f":"IF(Status!H$19=0,Data!L26,NA())","v":{"$error":"#N/A"}},{"$f":"IF(Status!I$19=0,Data!M26,NA())","v":{"$error":"#N/A"}},{"$f":"IF(Status!J$19=0,Data!N26,NA())","v":{"$error":"#N/A"}},{"$f":"IF(Status!K$19=0,Data!O26,NA())","v":{"$error":"#N/A"}},{"$f":"IF(Status!L$19=0,Data!P26,NA())","v":{"$error":"#N/A"}},{"$f":"IF(Status!M$19=0,Data!Q26,NA())","v":{"$error":"#N/A"}},{"$f":"IF(Status!N$19=0,Data!R26,NA())","v":{"$error":"#N/A"}},{"$f":"IF(Status!O$19=0,Data!S26,NA())","v":{"$error":"#N/A"}}]
[null,"Green",{"$f":"IF(Status!D$19=1,Data!H26,NA())","v":{"$error":"#N/A"}},{"$f":"IF(Status!E$19=1,Data!I26,NA())","v":{"$error":"#N/A"}},{"$f":"IF(Status!F$19=1,Data!J26,NA())","v":{"$error":"#N/A"}},{"$f":"IF(Status!G$19=1,Data!K26,NA())","v":{"$error":"#N/A"}},{"$f":"IF(Status!H$19=1,Data!L26,NA())","v":{"$error":"#N/A"}},{"$f":"IF(Status!I$19=1,Data!M26,NA())","v":{"$error":"#N/A"}},{"$f":"IF(Status!J$19=1,Data!N26,NA())","v":{"$error":"#N/A"}},{"$f":"IF(Status!K$19=1,Data!O26,NA())","v":{"$error":"#N/A"}},{"$f":"IF(Status!L$19=1,Data!P26,NA())","v":{"$error":"#N/A"}},{"$f":"IF(Status!M$19=1,Data!Q26,NA())","v":{"$error":"#N/A"}},{"$f":"IF(Status!N$19=1,Data!R26,NA())","v":{"$error":"#N/A"}},{"$f":"IF(Status!O$19=1,Data!S26,NA())","v":{"$error":"#N/A"}}]
[null,{"$f":"B31","v":"Meta"},{"$f":"IF(Data!$D$26=\"\",NA(),IF(Data!H27=\"\",NA(),Data!H27))","v":15500},{"$f":"IF(Data!$D$26=\"\",NA(),IF(Data!I27=\"\",NA(),Data!I27))","v":16000},{"$f":"IF(Data!$D$26=\"\",NA(),IF(Data!J27=\"\",NA(),Data!J27))","v":{"$error":"#N/A"}},{"$f":"IF(Data!$D$26=\"\",NA(),IF(Data!K27=\"\",NA(),Data!K27))","v":{"$error":"#N/A"}},{"$f":"IF(Data!$D$26=\"\",NA(),IF(Data!L27=\"\",NA(),Data!L27))","v":{"$error":"#N/A"}},{"$f":"IF(Data!$D$26=\"\",NA(),IF(Data!M27=\"\",NA(),Data!M27))","v":{"$error":"#N/A"}},{"$f":"IF(Data!$D$26=\"\",NA(),IF(Data!N27=\"\",NA(),Data!N27))","v":{"$error":"#N/A"}},{"$f":"IF(Data!$D$26=\"\",NA(),IF(Data!O27=\"\",NA(),Data!O27))","v":{"$error":"#N/A"}},{"$f":"IF(Data!$D$26=\"\",NA(),IF(Data!P27=\"\",NA(),Data!P27))","v":{"$error":"#N/A"}},{"$f":"IF(Data!$D$26=\"\",NA(),IF(Data!Q27=\"\",NA(),Data!Q27))","v":{"$error":"#N/A"}},{"$f":"IF(Data!$D$26=\"\",NA(),IF(Data!R27=\"\",NA(),Data!R27))","v":{"$error":"#N/A"}},{"$f":"IF(Data!$D$26=\"\",NA(),IF(Data!S27=\"\",NA(),Data!S27))","v":{"$error":"#N/A"}}]
[null,"Red",{"$f":"IF(Status!D$21=-1,Data!H29,NA())","v":{"$error":"#N/A"}},{"$f":"IF(Status!E$21=-1,Data!I29,NA())","v":{"$error":"#N/A"}},{"$f":"IF(Status!F$21=-1,Data!J29,NA())","v":{"$error":"#N/A"}},{"$f":"IF(Status!G$21=-1,Data!K29,NA())","v":{"$error":"#N/A"}},{"$f":"IF(Status!H$21=-1,Data!L29,NA())","v":{"$error":"#N/A"}},{"$f":"IF(Status!I$21=-1,Data!M29,NA())","v":{"$error":"#N/A"}},{"$f":"IF(Status!J$21=-1,Data!N29,NA())","v":{"$error":"#N/A"}},{"$f":"IF(Status!K$21=-1,Data!O29,NA())","v":{"$error":"#N/A"}},{"$f":"IF(Status!L$21=-1,Data!P29,NA())","v":{"$error":"#N/A"}},{"$f":"IF(Status!M$21=-1,Data!Q29,NA())","v":{"$error":"#N/A"}},{"$f":"IF(Status!N$21=-1,Data!R29,NA())","v":{"$error":"#N/A"}},{"$f":"IF(Status!O$21=-1,Data!S29,NA())","v":{"$error":"#N/A"}}]
[null,"Yellow",{"$f":"IF(Status!D$21=0,Data!H29,NA())","v":{"$error":"#N/A"}},{"$f":"IF(Status!E$21=0,Data!I29,NA())","v":{"$error":"#N/A"}},{"$f":"IF(Status!F$21=0,Data!J29,NA())","v":{"$error":"#N/A"}},{"$f":"IF(Status!G$21=0,Data!K29,NA())","v":{"$error":"#N/A"}},{"$f":"IF(Status!H$21=0,Data!L29,NA())","v":{"$error":"#N/A"}},{"$f":"IF(Status!I$21=0,Data!M29,NA())","v":{"$error":"#N/A"}},{"$f":"IF(Status!J$21=0,Data!N29,NA())","v":{"$error":"#N/A"}},{"$f":"IF(Status!K$21=0,Data!O29,NA())","v":{"$error":"#N/A"}},{"$f":"IF(Status!L$21=0,Data!P29,NA())","v":{"$error":"#N/A"}},{"$f":"IF(Status!M$21=0,Data!Q29,NA())","v":{"$error":"#N/A"}},{"$f":"IF(Status!N$21=0,Data!R29,NA())","v":{"$error":"#N/A"}},{"$f":"IF(Status!O$21=0,Data!S29,NA())","v":{"$error":"#N/A"}}]
[null,"Green",{"$f":"IF(Status!D$21=1,Data!H29,NA())","v":{"$error":"#N/A"}},{"$f":"IF(Status!E$21=1,Data!I29,NA())","v":{"$error":"#N/A"}},{"$f":"IF(Status!F$21=1,Data!J29,NA())","v":{"$error":"#N/A"}},{"$f":"IF(Status!G$21=1,Data!K29,NA())","v":{"$error":"#N/A"}},{"$f":"IF(Status!H$21=1,Data!L29,NA())","v":{"$error":"#N/A"}},{"$f":"IF(Status!I$21=1,Data!M29,NA())","v":{"$error":"#N/A"}},{"$f":"IF(Status!J$21=1,Data!N29,NA())","v":{"$error":"#N/A"}},{"$f":"IF(Status!K$21=1,Data!O29,NA())","v":{"$error":"#N/A"}},{"$f":"IF(Status!L$21=1,Data!P29,NA())","v":{"$error":"#N/A"}},{"$f":"IF(Status!M$21=1,Data!Q29,NA())","v":{"$error":"#N/A"}},{"$f":"IF(Status!N$21=1,Data!R29,NA())","v":{"$error":"#N/A"}},{"$f":"IF(Status!O$21=1,Data!S29,NA())","v":{"$error":"#N/A"}}]
[null,{"$f":"B35","v":"Meta"},{"$f":"IF(Data!$D$29=\"\",NA(),IF(Data!H30=\"\",NA(),Data!H30))","v":{"$error":"#N/A"}},{"$f":"IF(Data!$D$29=\"\",NA(),IF(Data!I30=\"\",NA(),Data!I30))","v":{"$error":"#N/A"}},{"$f":"IF(Data!$D$29=\"\",NA(),IF(Data!J30=\"\",NA(),Data!J30))","v":{"$error":"#N/A"}},{"$f":"IF(Data!$D$29=\"\",NA(),IF(Data!K30=\"\",NA(),Data!K30))","v":{"$error":"#N/A"}},{"$f":"IF(Data!$D$29=\"\",NA(),IF(Data!L30=\"\",NA(),Data!L30))","v":{"$error":"#N/A"}},{"$f":"IF(Data!$D$29=\"\",NA(),IF(Data!M30=\"\",NA(),Data!M30))","v":{"$error":"#N/A"}},{"$f":"IF(Data!$D$29=\"\",NA(),IF(Data!N30=\"\",NA(),Data!N30))","v":{"$error":"#N/A"}},{"$f":"IF(Data!$D$29=\"\",NA(),IF(Data!O30=\"\",NA(),Data!O30))","v":{"$error":"#N/A"}},{"$f":"IF(Data!$D$29=\"\",NA(),IF(Data!P30=\"\",NA(),Data!P30))","v":{"$error":"#N/A"}},{"$f":"IF(Data!$D$29=\"\",NA(),IF(Data!Q30=\"\",NA(),Data!Q30))","v":{"$error":"#N/A"}},{"$f":"IF(Data!$D$29=\"\",NA(),IF(Data!R30=\"\",NA(),Data!R30))","v":{"$error":"#N/A"}},{"$f":"IF(Data!$D$29=\"\",NA(),IF(Data!S30=\"\",NA(),Data!S30))","v":{"$error":"#N/A"}}]
[null,"Red",{"$f":"IF(Status!D$23=-1,Data!H32,NA())","v":{"$error":"#N/A"}},{"$f":"IF(Status!E$23=-1,Data!I32,NA())","v":{"$error":"#N/A"}},{"$f":"IF(Status!F$23=-1,Data!J32,NA())","v":{"$error":"#N/A"}},{"$f":"IF(Status!G$23=-1,Data!K32,NA())","v":{"$error":"#N/A"}},{"$f":"IF(Status!H$23=-1,Data!L32,NA())","v":{"$error":"#N/A"}},{"$f":"IF(Status!I$23=-1,Data!M32,NA())","v":{"$error":"#N/A"}},{"$f":"IF(Status!J$23=-1,Data!N32,NA())","v":{"$error":"#N/A"}},{"$f":"IF(Status!K$23=-1,Data!O32,NA())","v":{"$error":"#N/A"}},{"$f":"IF(Status!L$23=-1,Data!P32,NA())","v":{"$error":"#N/A"}},{"$f":"IF(Status!M$23=-1,Data!Q32,NA())","v":{"$error":"#N/A"}},{"$f":"IF(Status!N$23=-1,Data!R32,NA())","v":{"$error":"#N/A"}},{"$f":"IF(Status!O$23=-1,Data!S32,NA())","v":{"$error":"#N/A"}}]
[null,"Yellow",{"$f":"IF(Status!D$23=0,Data!H32,NA())","v":{"$error":"#N/A"}},{"$f":"IF(Status!E$23=0,Data!I32,NA())","v":{"$error":"#N/A"}},{"$f":"IF(Status!F$23=0,Data!J32,NA())","v":{"$error":"#N/A"}},{"$f":"IF(Status!G$23=0,Data!K32,NA())","v":{"$error":"#N/A"}},{"$f":"IF(Status!H$23=0,Data!L32,NA())","v":{"$error":"#N/A"}},{"$f":"IF(Status!I$23=0,Data!M32,NA())","v":{"$error":"#N/A"}},{"$f":"IF(Status!J$23=0,Data!N32,NA())","v":{"$error":"#N/A"}},{"$f":"IF(Status!K$23=0,Data!O32,NA())","v":{"$error":"#N/A"}},{"$f":"IF(Status!L$23=0,Data!P32,NA())","v":{"$error":"#N/A"}},{"$f":"IF(Status!M$23=0,Data!Q32,NA())","v":{"$error":"#N/A"}},{"$f":"IF(Status!N$23=0,Data!R32,NA())","v":{"$error":"#N/A"}},{"$f":"IF(Status!O$23=0,Data!S32,NA())","v":{"$error":"#N/A"}}]
[null,"Green",{"$f":"IF(Status!D$23=1,Data!H32,NA())","v":{"$error":"#N/A"}},{"$f":"IF(Status!E$23=1,Data!I32,NA())","v":{"$error":"#N/A"}},{"$f":"IF(Status!F$23=1,Data!J32,NA())","v":{"$error":"#N/A"}},{"$f":"IF(Status!G$23=1,Data!K32,NA())","v":{"$error":"#N/A"}},{"$f":"IF(Status!H$23=1,Data!L32,NA())","v":{"$error":"#N/A"}},{"$f":"IF(Status!I$23=1,Data!M32,NA())","v":{"$error":"#N/A"}},{"$f":"IF(Status!J$23=1,Data!N32,NA())","v":{"$error":"#N/A"}},{"$f":"IF(Status!K$23=1,Data!O32,NA())","v":{"$error":"#N/A"}},{"$f":"IF(Status!L$23=1,Data!P32,NA())","v":{"$error":"#N/A"}},{"$f":"IF(Status!M$23=1,Data!Q32,NA())","v":{"$error":"#N/A"}},{"$f":"IF(Status!N$23=1,Data!R32,NA())","v":{"$error":"#N/A"}},{"$f":"IF(Status!O$23=1,Data!S32,NA())","v":{"$error":"#N/A"}}]
[null,{"$f":"B39","v":"Meta"},{"$f":"IF(Data!$D$32=\"\",NA(),IF(Data!H33=\"\",NA(),Data!H33))","v":{"$error":"#N/A"}},{"$f":"IF(Data!$D$32=\"\",NA(),IF(Data!I33=\"\",NA(),Data!I33))","v":{"$error":"#N/A"}},{"$f":"IF(Data!$D$32=\"\",NA(),IF(Data!J33=\"\",NA(),Data!J33))","v":{"$error":"#N/A"}},{"$f":"IF(Data!$D$32=\"\",NA(),IF(Data!K33=\"\",NA(),Data!K33))","v":{"$error":"#N/A"}},{"$f":"IF(Data!$D$32=\"\",NA(),IF(Data!L33=\"\",NA(),Data!L33))","v":{"$error":"#N/A"}},{"$f":"IF(Data!$D$32=\"\",NA(),IF(Data!M33=\"\",NA(),Data!M33))","v":{"$error":"#N/A"}},{"$f":"IF(Data!$D$32=\"\",NA(),IF(Data!N33=\"\",NA(),Data!N33))","v":{"$error":"#N/A"}},{"$f":"IF(Data!$D$32=\"\",NA(),IF(Data!O33=\"\",NA(),Data!O33))","v":{"$error":"#N/A"}},{"$f":"IF(Data!$D$32=\"\",NA(),IF(Data!P33=\"\",NA(),Data!P33))","v":{"$error":"#N/A"}},{"$f":"IF(Data!$D$32=\"\",NA(),IF(Data!Q33=\"\",NA(),Data!Q33))","v":{"$error":"#N/A"}},{"$f":"IF(Data!$D$32=\"\",NA(),IF(Data!R33=\"\",NA(),Data!R33))","v":{"$error":"#N/A"}},{"$f":"IF(Data!$D$32=\"\",NA(),IF(Data!S33=\"\",NA(),Data!S33))","v":{"$error":"#N/A"}}]
[null,"Red",{"$f":"IF(Status!D$25=-1,Data!H35,NA())","v":{"$error":"#N/A"}},{"$f":"IF(Status!E$25=-1,Data!I35,NA())","v":{"$error":"#N/A"}},{"$f":"IF(Status!F$25=-1,Data!J35,NA())","v":{"$error":"#N/A"}},{"$f":"IF(Status!G$25=-1,Data!K35,NA())","v":{"$error":"#N/A"}},{"$f":"IF(Status!H$25=-1,Data!L35,NA())","v":{"$error":"#N/A"}},{"$f":"IF(Status!I$25=-1,Data!M35,NA())","v":{"$error":"#N/A"}},{"$f":"IF(Status!J$25=-1,Data!N35,NA())","v":{"$error":"#N/A"}},{"$f":"IF(Status!K$25=-1,Data!O35,NA())","v":{"$error":"#N/A"}},{"$f":"IF(Status!L$25=-1,Data!P35,NA())","v":{"$error":"#N/A"}},{"$f":"IF(Status!M$25=-1,Data!Q35,NA())","v":{"$error":"#N/A"}},{"$f":"IF(Status!N$25=-1,Data!R35,NA())","v":{"$error":"#N/A"}},{"$f":"IF(Status!O$25=-1,Data!S35,NA())","v":{"$error":"#N/A"}}]
[null,"Yellow",{"$f":"IF(Status!D$25=0,Data!H35,NA())","v":{"$error":"#N/A"}},{"$f":"IF(Status!E$25=0,Data!I35,NA())","v":{"$error":"#N/A"}},{"$f":"IF(Status!F$25=0,Data!J35,NA())","v":{"$error":"#N/A"}},{"$f":"IF(Status!G$25=0,Data!K35,NA())","v":{"$error":"#N/A"}},{"$f":"IF(Status!H$25=0,Data!L35,NA())","v":{"$error":"#N/A"}},{"$f":"IF(Status!I$25=0,Data!M35,NA())","v":{"$error":"#N/A"}},{"$f":"IF(Status!J$25=0,Data!N35,NA())","v":{"$error":"#N/A"}},{"$f":"IF(Status!K$25=0,Data!O35,NA())","v":{"$error":"#N/A"}},{"$f":"IF(Status!L$25=0,Data!P35,NA())","v":{"$error":"#N/A"}},{"$f":"IF(Status!M$25=0,Data!Q35,NA())","v":{"$error":"#N/A"}},{"$f":"IF(Status!N$25=0,Data!R35,NA())","v":{"$error":"#N/A"}},{"$f":"IF(Status!O$25=0,Data!S35,NA())","v":{"$error":"#N/A"}}]
[null,"Green",{"$f":"IF(Status!D$25=1,Data!H35,NA())","v":{"$error":"#N/A"}},{"$f":"IF(Status!E$25=1,Data!I35,NA())","v":{"$error":"#N/A"}},{"$f":"IF(Status!F$25=1,Data!J35,NA())","v":{"$error":"#N/A"}},{"$f":"IF(Status!G$25=1,Data!K35,NA())","v":{"$error":"#N/A"}},{"$f":"IF(Status!H$25=1,Data!L35,NA())","v":{"$error":"#N/A"}},{"$f":"IF(Status!I$25=1,Data!M35,NA())","v":{"$error":"#N/A"}},{"$f":"IF(Status!J$25=1,Data!N35,NA())","v":{"$error":"#N/A"}},{"$f":"IF(Status!K$25=1,Data!O35,NA())","v":{"$error":"#N/A"}},{"$f":"IF(Status!L$25=1,Data!P35,NA())","v":{"$error":"#N/A"}},{"$f":"IF(Status!M$25=1,Data!Q35,NA())","v":{"$error":"#N/A"}},{"$f":"IF(Status!N$25=1,Data!R35,NA())","v":{"$error":"#N/A"}},{"$f":"IF(Status!O$25=1,Data!S35,NA())","v":{"$error":"#N/A"}}]
[null,{"$f":"B43","v":"Meta"},{"$f":"IF(Data!$D$35=\"\",NA(),IF(Data!H36=\"\",NA(),Data!H36))","v":{"$error":"#N/A"}},{"$f":"IF(Data!$D$35=\"\",NA(),IF(Data!I36=\"\",NA(),Data!I36))","v":{"$error":"#N/A"}},{"$f":"IF(Data!$D$35=\"\",NA(),IF(Data!J36=\"\",NA(),Data!J36))","v":{"$error":"#N/A"}},{"$f":"IF(Data!$D$35=\"\",NA(),IF(Data!K36=\"\",NA(),Data!K36))","v":{"$error":"#N/A"}},{"$f":"IF(Data!$D$35=\"\",NA(),IF(Data!L36=\"\",NA(),Data!L36))","v":{"$error":"#N/A"}},{"$f":"IF(Data!$D$35=\"\",NA(),IF(Data!M36=\"\",NA(),Data!M36))","v":{"$error":"#N/A"}},{"$f":"IF(Data!$D$35=\"\",NA(),IF(Data!N36=\"\",NA(),Data!N36))","v":{"$error":"#N/A"}},{"$f":"IF(Data!$D$35=\"\",NA(),IF(Data!O36=\"\",NA(),Data!O36))","v":{"$error":"#N/A"}},{"$f":"IF(Data!$D$35=\"\",NA(),IF(Data!P36=\"\",NA(),Data!P36))","v":{"$error":"#N/A"}},{"$f":"IF(Data!$D$35=\"\",NA(),IF(Data!Q36=\"\",NA(),Data!Q36))","v":{"$error":"#N/A"}},{"$f":"IF(Data!$D$35=\"\",NA(),IF(Data!R36=\"\",NA(),Data!R36))","v":{"$error":"#N/A"}},{"$f":"IF(Data!$D$35=\"\",NA(),IF(Data!S36=\"\",NA(),Data!S36))","v":{"$error":"#N/A"}}]
[null,"Red",{"$f":"IF(Status!D$27=-1,Data!H38,NA())","v":{"$error":"#N/A"}},{"$f":"IF(Status!E$27=-1,Data!I38,NA())","v":{"$error":"#N/A"}},{"$f":"IF(Status!F$27=-1,Data!J38,NA())","v":{"$error":"#N/A"}},{"$f":"IF(Status!G$27=-1,Data!K38,NA())","v":{"$error":"#N/A"}},{"$f":"IF(Status!H$27=-1,Data!L38,NA())","v":{"$error":"#N/A"}},{"$f":"IF(Status!I$27=-1,Data!M38,NA())","v":{"$error":"#N/A"}},{"$f":"IF(Status!J$27=-1,Data!N38,NA())","v":{"$error":"#N/A"}},{"$f":"IF(Status!K$27=-1,Data!O38,NA())","v":{"$error":"#N/A"}},{"$f":"IF(Status!L$27=-1,Data!P38,NA())","v":{"$error":"#N/A"}},{"$f":"IF(Status!M$27=-1,Data!Q38,NA())","v":{"$error":"#N/A"}},{"$f":"IF(Status!N$27=-1,Data!R38,NA())","v":{"$error":"#N/A"}},{"$f":"IF(Status!O$27=-1,Data!S38,NA())","v":{"$error":"#N/A"}}]
[null,"Yellow",{"$f":"IF(Status!D$27=0,Data!H38,NA())","v":{"$error":"#N/A"}},{"$f":"IF(Status!E$27=0,Data!I38,NA())","v":{"$error":"#N/A"}},{"$f":"IF(Status!F$27=0,Data!J38,NA())","v":{"$error":"#N/A"}},{"$f":"IF(Status!G$27=0,Data!K38,NA())","v":{"$error":"#N/A"}},{"$f":"IF(Status!H$27=0,Data!L38,NA())","v":{"$error":"#N/A"}},{"$f":"IF(Status!I$27=0,Data!M38,NA())","v":{"$error":"#N/A"}},{"$f":"IF(Status!J$27=0,Data!N38,NA())","v":{"$error":"#N/A"}},{"$f":"IF(Status!K$27=0,Data!O38,NA())","v":{"$error":"#N/A"}},{"$f":"IF(Status!L$27=0,Data!P38,NA())","v":{"$error":"#N/A"}},{"$f":"IF(Status!M$27=0,Data!Q38,NA())","v":{"$error":"#N/A"}},{"$f":"IF(Status!N$27=0,Data!R38,NA())","v":{"$error":"#N/A"}},{"$f":"IF(Status!O$27=0,Data!S38,NA())","v":{"$error":"#N/A"}}]
[null,"Green",{"$f":"IF(Status!D$27=1,Data!H38,NA())","v":{"$error":"#N/A"}},{"$f":"IF(Status!E$27=1,Data!I38,NA())","v":{"$error":"#N/A"}},{"$f":"IF(Status!F$27=1,Data!J38,NA())","v":{"$error":"#N/A"}},{"$f":"IF(Status!G$27=1,Data!K38,NA())","v":{"$error":"#N/A"}},{"$f":"IF(Status!H$27=1,Data!L38,NA())","v":{"$error":"#N/A"}},{"$f":"IF(Status!I$27=1,Data!M38,NA())","v":{"$error":"#N/A"}},{"$f":"IF(Status!J$27=1,Data!N38,NA())","v":{"$error":"#N/A"}},{"$f":"IF(Status!K$27=1,Data!O38,NA())","v":{"$error":"#N/A"}},{"$f":"IF(Status!L$27=1,Data!P38,NA())","v":{"$error":"#N/A"}},{"$f":"IF(Status!M$27=1,Data!Q38,NA())","v":{"$error":"#N/A"}},{"$f":"IF(Status!N$27=1,Data!R38,NA())","v":{"$error":"#N/A"}},{"$f":"IF(Status!O$27=1,Data!S38,NA())","v":{"$error":"#N/A"}}]
[null,{"$f":"B47","v":"Meta"},{"$f":"IF(Data!$D$38=\"\",NA(),IF(Data!H39=\"\",NA(),Data!H39))","v":{"$error":"#N/A"}},{"$f":"IF(Data!$D$38=\"\",NA(),IF(Data!I39=\"\",NA(),Data!I39))","v":{"$error":"#N/A"}},{"$f":"IF(Data!$D$38=\"\",NA(),IF(Data!J39=\"\",NA(),Data!J39))","v":{"$error":"#N/A"}},{"$f":"IF(Data!$D$38=\"\",NA(),IF(Data!K39=\"\",NA(),Data!K39))","v":{"$error":"#N/A"}},{"$f":"IF(Data!$D$38=\"\",NA(),IF(Data!L39=\"\",NA(),Data!L39))","v":{"$error":"#N/A"}},{"$f":"IF(Data!$D$38=\"\",NA(),IF(Data!M39=\"\",NA(),Data!M39))","v":{"$error":"#N/A"}},{"$f":"IF(Data!$D$38=\"\",NA(),IF(Data!N39=\"\",NA(),Data!N39))","v":{"$error":"#N/A"}},{"$f":"IF(Data!$D$38=\"\",NA(),IF(Data!O39=\"\",NA(),Data!O39))","v":{"$error":"#N/A"}},{"$f":"IF(Data!$D$38=\"\",NA(),IF(Data!P39=\"\",NA(),Data!P39))","v":{"$error":"#N/A"}},{"$f":"IF(Data!$D$38=\"\",NA(),IF(Data!Q39=\"\",NA(),Data!Q39))","v":{"$error":"#N/A"}},{"$f":"IF(Data!$D$38=\"\",NA(),IF(Data!R39=\"\",NA(),Data!R39))","v":{"$error":"#N/A"}},{"$f":"IF(Data!$D$38=\"\",NA(),IF(Data!S39=\"\",NA(),Data!S39))","v":{"$error":"#N/A"}}]

{"sheet":"List","index":9,"n_rows":15,"n_cols":8,"rows_kept":15,"cut":false,"hidden":false,"merged":[]}
["Month","MonthComp","MonthOrder","MonthOrderComp","Language","Format","Direction","Calculation"]
[{"$f":"Translations!G34","v":"ENE"},{"$f":"Translations!G46","v":"Enero"},null,null,"English","0%","↑",{"$f":"Translations!G67","v":"Suma"}]
[{"$f":"Translations!G35","v":"FEB"},{"$f":"Translations!G47","v":"Febrero"},null,null,"Français","0,0%","↓",{"$f":"Translations!G68","v":"Promedio"}]
[{"$f":"Translations!G36","v":"MAR"},{"$f":"Translations!G48","v":"Marzo"},null,null,"Português","0",null,{"$f":"Translations!G69","v":"Último valor"}]
[{"$f":"Translations!G37","v":"ABR"},{"$f":"Translations!G49","v":"Abril"},null,null,"Español","0,0"]
[{"$f":"Translations!G38","v":"MAY"},{"$f":"Translations!G50","v":"Mayo"},null,null,null,"0 $"]
[{"$f":"Translations!G39","v":"JUN"},{"$f":"Translations!G51","v":"Junio"},null,null,null,"0 €"]
[{"$f":"Translations!G40","v":"JUL"},{"$f":"Translations!G52","v":"Julio"},null,null,null,"£ 0"]
[{"$f":"Translations!G41","v":"AGO"},{"$f":"Translations!G53","v":"Agosto"},null,null,null,"R$ 0"]
[{"$f":"Translations!G42","v":"SEP"},{"$f":"Translations!G54","v":"Septiembre"},null,null,null,"00:00:00"]
[{"$f":"Translations!G43","v":"OCT"},{"$f":"Translations!G55","v":"Octubre"}]
[{"$f":"Translations!G44","v":"NOV"},{"$f":"Translations!G56","v":"Noviembre"}]
[{"$f":"Translations!G45","v":"DIC"},{"$f":"Translations!G57","v":"Diciembre"}]
[{"$f":"Translations!G31","v":"ACUM"}]
[{"$f":"UPPER(Translations!G32)","v":"TOTAL"}]